Reply To: problem build apk

#11185

Jorge Olvera
Participant
thanks for response, now have this error   :app:compileReleaseJavaWithJavac /Volumes/falcon/System/Emprendeme/Emprendeme/CLIENTES/upscale media/appdev/rec/platforms/android/app/src/main/java/com/alexdisler/inapppurchases/IabHelper.java:33: error: package com.android.vending.billing does not exist   import com.android.vending.billing.IInAppBillingService; ^ /Volumes/falcon/System/Emprendeme/Emprendeme/CLIENTES/upscale media/appdev/rec/platforms/android/app/src/main/java/com/alexdisler/inapppurchases/IabHelper.java:103: error: cannot find symbol   IInAppBillingService mService; ^ symbol:   class IInAppBillingService   location: class IabHelper /Volumes/falcon/System/Emprendeme/Emprendeme/CLIENTES/upscale media/appdev/rec/platforms/android/app/src/main/java/com/alexdisler/inapppurchases/IabHelper.java:230: error: package IInAppBillingService does not exist   mService = IInAppBillingService.Stub.asInterface(service); ^ Note: Some input files use or override a deprecated API. Note: Recompile with -Xlint:deprecation for details. Note: Some input files use unchecked or unsafe operations. Note: Recompile with -Xlint:unchecked for details. 3 errors FAILED   FAILURE: Build failed with an exception.   * What went wrong: Execution failed for task ':app:compileReleaseJavaWithJavac'. > Compilation failed; see the compiler error output for details.   * Try: Run with --stacktrace option to get the stack trace. Run with --info or --debug option to get more log output.   * Get more help at https://help.gradle.org   BUILD FAILED in 32s 39 actionable tasks: 39 executed (node:2228) UnhandledPromiseRejectionWarning: Error: /Volumes/falcon/System/Emprendeme/Emprendeme/CLIENTES/upscale media/appdev/rec/platforms/android/gradlew: Command failed with exit code 1 Error output: Note: Some input files use or override a deprecated API. Note: Recompile with -Xlint:deprecation for details. /Volumes/falcon/System/Emprendeme/Emprendeme/CLIENTES/upscale media/appdev/rec/platforms/android/app/src/main/java/com/alexdisler/inapppurchases/IabHelper.java:33: error: package com.android.vending.billing does not exist import com.android.vending.billing.IInAppBillingService; ^ /Volumes/falcon/System/Emprendeme/Emprendeme/CLIENTES/upscale media/appdev/rec/platforms/android/app/src/main/java/com/alexdisler/inapppurchases/IabHelper.java:103: error: cannot find symbol IInAppBillingService mService; ^ symbol:   class IInAppBillingService location: class IabHelper /Volumes/falcon/System/Emprendeme/Emprendeme/CLIENTES/upscale media/appdev/rec/platforms/android/app/src/main/java/com/alexdisler/inapppurchases/IabHelper.java:230: error: package IInAppBillingService does not exist mService = IInAppBillingService.Stub.asInterface(service); ^ Note: Some input files use or override a deprecated API. Note: Recompile with -Xlint:deprecation for details. Note: Some input files use unchecked or unsafe operations. Note: Recompile with -Xlint:unchecked for details. 3 errors   FAILURE: Build failed with an exception.   * What went wrong: Execution failed for task ':app:compileReleaseJavaWithJavac'. > Compilation failed; see the compiler error output for details.   * Try: Run with --stacktrace option to get the stack trace. Run with --info or --debug option to get more log output.   * Get more help at https://help.gradle.org   BUILD FAILED in 32s at ChildProcess.whenDone (/Volumes/falcon/System/Emprendeme/Emprendeme/CLIENTES/upscale media/appdev/rec/platforms/android/cordova/node_modules/cordova-common/src/superspawn.js:169:23) at emitTwo (events.js:126:13) at ChildProcess.emit (events.js:214:7) at maybeClose (internal/child_process.js:925:16) at Socket.stream.socket.on (internal/child_process.js:346:11) at emitOne (events.js:116:13) at Socket.emit (events.js:211:7) at Pipe._handle.close [as _onclose] (net.js:567:12) (node:2228) UnhandledPromiseRejectionWarning: Unhandled promise rejection. This error originated either by throwing inside of an async function without a catch block, or by rejecting a promise which was not handled with .catch(). (rejection id: 1) (node:2228) [DEP0018] DeprecationWarning: Unhandled promise rejections are deprecated. In the future, promise rejections that are not handled will terminate the Node.js process with a non-zero exit code.

izmir escort

antalya escort

izmir escort

antalya escort

izmir escort

bursa escort

porno izle

porno izle

porno izle

escort istanbul

instagram ucuz takipçi satın al

takipçi hilesi

takipçi satın al

instagram takipçi hilesi

takipçi satın al

instagram takipçi hilesi

izmir escort

bornova escort bayan

buca escort bayan

karşıyaka escort bayan

çeşme escort bayan

takipçi satın al

instagram takipçi satın al

instagram takipçi satın al

sex hikayesi

smm panel

haberler

istanbul escort

instagram takipçi satın al

instagram takipçi satın al

instagram takipçi satın al

twitter takipçi

tiktok takipçi satın al