WordPress LMS for Web and mobile Forums Ionic App Support problems with .apk generate Reply To: problems with .apk generate

Reply To: problems with .apk generate

WordPress LMS for Web and mobile Forums Ionic App Support problems with .apk generate Reply To: problems with .apk generate

#11352

Daniel
Participant
I made the changes that you indicated to me but now this error generates me: C:\Users\Nexcorp\Documents\ionic\wplms>ionic cordova build --release android Running app-scripts build: --platform android --target cordova [10:10:37]  build dev started ... [10:10:37]  clean started ... [10:10:37]  clean finished in 4 ms [10:10:37]  copy started ... [10:10:37]  deeplinks started ... [10:10:38]  deeplinks finished in 410 ms [10:10:38]  transpile started ... [10:10:43]  transpile finished in 5.54 s [10:10:43]  preprocess started ... [10:10:43]  preprocess finished in 1 ms [10:10:43]  webpack started ... [10:10:44]  copy finished in 6.26 s [10:10:51]  webpack finished in 8.05 s [10:10:51]  sass started ... [10:10:53]  sass finished in 1.13 s [10:10:53]  postprocess started ... [10:10:53]  postprocess finished in 9 ms [10:10:53]  lint started ... [10:10:53]  build dev finished in 15.37 s > cordova build android --release Android Studio project detected   ANDROID_HOME=C:\Users\Nexcorp\AppData\Local\Android\Sdk JAVA_HOME=C:\Program Files\Java\jdk1.8.0_144 studio Subproject Path: CordovaLib Subproject Path: app publishNonDefault is deprecated and has no effect anymore. All variants are now published.   The Task.leftShift(Closure) method has been deprecated and is scheduled to be removed in Gradle 5.0. Please use Task.doLast(Action) instead. at build_4patict3zccmo1j8jeng0y3li.run(C:\Users\Nexcorp\Documents\ionic\wplms\platforms\android\app\build.gradle:143) Configuration 'compile' in project ':app' is deprecated. Use 'implementation' instead. :CordovaLib:preBuild UP-TO-DATE :CordovaLib:preReleaseBuild UP-TO-DATE :CordovaLib:compileReleaseAidl UP-TO-DATE :CordovaLib:compileReleaseRenderscript UP-TO-DATE :CordovaLib:checkReleaseManifest UP-TO-DATE :CordovaLib:generateReleaseBuildConfig UP-TO-DATE :CordovaLib:prepareLintJar UP-TO-DATE :CordovaLib:generateReleaseResValues UP-TO-DATE :CordovaLib:generateReleaseResources UP-TO-DATE :CordovaLib:packageReleaseResources UP-TO-DATE :CordovaLib:platformAttrExtractor UP-TO-DATE :CordovaLib:processReleaseManifest UP-TO-DATE :CordovaLib:processReleaseResources UP-TO-DATE :CordovaLib:generateReleaseSources UP-TO-DATE :CordovaLib:javaPreCompileRelease UP-TO-DATE :CordovaLib:compileReleaseJavaWithJavac UP-TO-DATE :CordovaLib:processReleaseJavaRes NO-SOURCE :CordovaLib:transformClassesAndResourcesWithPrepareIntermediateJarsForRelease UP-TO-DATE :app:preBuild UP-TO-DATE :app:preReleaseBuild UP-TO-DATE :app:compileReleaseAidl   UP-TO-DATE :CordovaLib:packageReleaseRenderscript NO-SOURCE :app:compileReleaseRenderscript UP-TO-DATE :app:checkReleaseManifest UP-TO-DATE :app:generateReleaseBuildConfig UP-TO-DATE :app:prepareLintJar UP-TO-DATE :app:generateReleaseResValues UP-TO-DATE :app:generateReleaseResources UP-TO-DATE :app:mergeReleaseResources   UP-TO-DATE :app:createReleaseCompatibleScreenManifests UP-TO-DATE :app:processReleaseManifest   UP-TO-DATE :app:splitsDiscoveryTaskRelease UP-TO-DATE :app:processReleaseResources   UP-TO-DATE :app:generateReleaseSources UP-TO-DATE :app:javaPreCompileRelease UP-TO-DATE :app:compileReleaseJavaWithJavac C:\Users\Nexcorp\Documents\ionic\wplms\platforms\android\app\src\main\java\com\alexdisler\inapppurchases\IabHelper.java:33: error: package com.android.vending.billing does not exist import com.android.vending.billing.IInAppBillingService;   ^ C:\Users\Nexcorp\Documents\ionic\wplms\platforms\android\app\src\main\java\com\alexdisler\inapppurchases\IabHelper.java:103: error: cannot find symbol IInAppBillingService mService; ^ symbol:   class IInAppBillingService location: class IabHelper C:\Users\Nexcorp\Documents\ionic\wplms\platforms\android\app\src\main\java\com\alexdisler\inapppurchases\IabHelper.java:230: error: package IInAppBillingService does not exist mService = IInAppBillingService.Stub.asInterface(service); ^ Note: Some input files use or override a deprecated API. Note: Recompile with -Xlint:deprecation for details. Note: Some input files use unchecked or unsafe operations. Note: Recompile with -Xlint:unchecked for details. 3 errors FAILED 27 actionable tasks: 1 executed, 26 up-to-date   FAILURE: Build failed with an exception.   * What went wrong: Execution failed for task ':app:compileReleaseJavaWithJavac'. > Compilation failed; see the compiler error output for details.   * Try: Run with --stacktrace option to get the stack trace. Run with --info or --debug option to get more log output.   * Get more help at https://help.gradle.org   BUILD FAILED in 3s (node:10696) UnhandledPromiseRejectionWarning: Error: cmd: Command failed with exit code 1 Error output: C:\Users\Nexcorp\Documents\ionic\wplms\platforms\android\app\src\main\java\com\alexdisler\inapppurchases\IabHelper.java:33: error: package com.android.vending.billing does not exist import com.android.vending.billing.IInAppBillingService; ^ C:\Users\Nexcorp\Documents\ionic\wplms\platforms\android\app\src\main\java\com\alexdisler\inapppurchases\IabHelper.java:103: error: cannot find symbol IInAppBillingService mService; ^ symbol:   class IInAppBillingService location: class IabHelper C:\Users\Nexcorp\Documents\ionic\wplms\platforms\android\app\src\main\java\com\alexdisler\inapppurchases\IabHelper.java:230: error: package IInAppBillingService does not exist mService = IInAppBillingService.Stub.asInterface(service); ^ Note: Some input files use or override a deprecated API. Note: Recompile with -Xlint:deprecation for details. Note: Some input files use unchecked or unsafe operations. Note: Recompile with -Xlint:unchecked for details. 3 errors   FAILURE: Build failed with an exception.   * What went wrong: Execution failed for task ':app:compileReleaseJavaWithJavac'. > Compilation failed; see the compiler error output for details.   * Try: Run with --stacktrace option to get the stack trace. Run with --info or --debug option to get more log output.   * Get more help at https://help.gradle.org   BUILD FAILED in 3s at ChildProcess.whenDone (C:\Users\Nexcorp\Documents\ionic\wplms\platforms\android\cordova\node_modules\cordova-common\src\superspawn.js:169:23) at emitTwo (events.js:126:13) at ChildProcess.emit (events.js:214:7) at maybeClose (internal/child_process.js:925:16) at Process.ChildProcess._handle.onexit (internal/child_process.js:209:5) (node:10696) UnhandledPromiseRejectionWarning: Unhandled promise rejection. This error originated either by throwing inside of an async function without a catch block, or by rejecting a promise which was not handled with .catch(). (rejection id: 1) (node:10696) [DEP0018] DeprecationWarning: Unhandled promise rejections are deprecated. In the future, promise rejections that are not handled will terminate the Node.js process with a non-zero exit code.

izmir escort

antalya escort

izmir escort

antalya escort

izmir escort

bursa escort

porno izle

porno izle

porno izle

escort istanbul