WordPress LMS for Web and mobile Forums Ionic App Support App build Android problem Reply To: App build Android problem

Reply To: App build Android problem

WordPress LMS for Web and mobile Forums Ionic App Support App build Android problem Reply To: App build Android problem

#12313

sudong
Participant
I just followed your advice,but my app shows like this (always refreshing) And when I run "ionic cordova build android"  it shows this: [20:06:53]  lint finished in 7.54 s Installing "cordova-sqlite-storage" for android   installing external dependencies via npm npm install of external dependencies ok ANDROID_HOME=D:\AndroidSDK\android-sdk-windows JAVA_HOME=C:\Program Files\Java\jdk1.8.0_171 Starting a Gradle Daemon (subsequent builds will be faster)   > Task :wrapper   BUILD SUCCESSFUL in 3m 16s 1 actionable task: 1 executed Subproject Path: CordovaLib Starting a Gradle Daemon, 2 busy and 1 incompatible and 1 stopped Daemons could not be reused, use - -status for details The Task.leftShift(Closure) method has been deprecated and is scheduled to be removed in Gradle 5.0. Please use Task.doLast(Action) instead. at build_hmvwgmwpfyjj9ej38qt0jvo8.run(D:\WenYi\App\5.19\wplms\platforms\android\build.gradle :137) Checking the license for package Android SDK Platform 25 in D:\AndroidSDK\android-sdk-windows\licens es Warning: License for package Android SDK Platform 25 not accepted.   FAILURE: Build failed with an exception.   * What went wrong: A problem occurred configuring root project 'android'. > You have not accepted the license agreements of the following SDK components: [Android SDK Platform 25]. Before building your project, you need to accept the license agreements and complete the installat ion of the missing components using the Android Studio SDK Manager. Alternatively, to learn how to transfer the license agreements from one workstation to another, go to http://d.android.com/r/studio-ui/export-licenses.html   * Try: Run with --stacktrace option to get the stack trace. Run with --info or --debug option to get more l og output.   * Get more help at https://help.gradle.org   BUILD FAILED in 6m 24s (node:4508) UnhandledPromiseRejectionWarning: Unhandled promise rejection (rejection id: 1): Error: cmd: Command failed with exit code 1 Error output: FAILURE: Build failed with an exception.   * What went wrong: A problem occurred configuring root project 'android'. > You have not accepted the license agreements of the following SDK components: [Android SDK Platform 25]. Before building your project, you need to accept the license agreements and complete the installat ion of the missing components using the Android Studio SDK Manager. Alternatively, to learn how to transfer the license agreements from one workstation to another, go to http://d.android.com/r/studio-ui/export-licenses.html   * Try: Run with --stacktrace option to get the stack trace. Run with --info or --debug option to get more l og output.   * Get more help at https://help.gradle.org   BUILD FAILED in 6m 24s (node:4508) [DEP0018] DeprecationWarning: Unhandled promise rejections are deprecated. In the future , promise rejections that are not handled will terminate the Node.js process with a non-zero exit code.  

izmir escort

antalya escort

izmir escort

antalya escort

izmir escort

bursa escort

porno izle

porno izle

porno izle

escort istanbul