WordPress LMS for Web and mobile Forums WPLMS Student App Runtime Error with videos (local & with WPLMS S3 based shortcodes) Reply To: Runtime Error with videos (local & with WPLMS S3 based shortcodes)

Reply To: Runtime Error with videos (local & with WPLMS S3 based shortcodes)

Back to course

WordPress LMS for Web and mobile Forums WPLMS Student App Runtime Error with videos (local & with WPLMS S3 based shortcodes) Reply To: Runtime Error with videos (local & with WPLMS S3 based shortcodes)

#12796

Peter O.
Participant
Hi Alex, You were able to build the .APK file with the ZIP file of my /projectFolder. I was able to install the build.apk that you provided and it runs well on my Android (Samsung Note4). I am still unable to build the .apk on my system, using the exact same project folder for my Ionic project as provided to you in the zip.  I tried: "ionic cordova build android" but it is failing.  I would sure love to know how your environment is capable of building the .apk but mine does not complete? To replicate my error, unzip the ionic project file (for the WPLMS Student App) as you did with info in the private message. Run "ionic cordova build android". My results for the build attempt are pasted below. Thank you for any assistance and help. Here is the result of "ionic cordova build android" showing the build error(s):
[02:31:28]  lint finished in 14.39 s Starting a Gradle Daemon, 1 incompatible and 1 stopped Daemons could not be reused, use --status for details The Task.leftShift(Closure) method has been deprecated and is scheduled to be removed in Gradle 5.0. Please use Task.doLast(Action) instead. at build_3eqvcfhtsrgecfsvxpc5mcyox.run(D:\-\DevMobi\wplms\qimoves\platforms\android\build.gradle:141) The JavaCompile.setDependencyCacheDir() method has been deprecated and is scheduled to be removed in Gradle 4.0. Incremental java compilation is an incubating feature. The TaskInputs.source(Object) method has been deprecated and is scheduled to be removed in Gradle 4.0. Please use TaskInputs.file(Object).skipWhenEmpty() instead. Download https://jcenter.bintray.com/com/facebook/android/facebook-android-sdk/4.34.0/facebook-android-sdk-4.34.0.pom Download https://jcenter.bintray.com/com/facebook/android/facebook-core/4.34.0/facebook-core-4.34.0.pom Download https://jcenter.bintray.com/com/facebook/android/facebook-common/4.34.0/facebook-common-4.34.0.pom Download https://jcenter.bintray.com/com/facebook/android/facebook-login/4.34.0/facebook-login-4.34.0.pom Download https://jcenter.bintray.com/com/facebook/android/facebook-share/4.34.0/facebook-share-4.34.0.pom Download https://jcenter.bintray.com/com/facebook/android/facebook-places/4.34.0/facebook-places-4.34.0.pom Download https://jcenter.bintray.com/com/facebook/android/facebook-applinks/4.34.0/facebook-applinks-4.34.0.pom Download https://jcenter.bintray.com/com/facebook/android/facebook-messenger/4.34.0/facebook-messenger-4.34.0.pom Download https://jcenter.bintray.com/com/facebook/android/facebook-marketing/4.34.0/facebook-marketing-4.34.0.pom Download https://jcenter.bintray.com/com/facebook/android/facebook-core/4.34.0/facebook-core-4.34.0.aar Download https://jcenter.bintray.com/com/facebook/android/facebook-common/4.34.0/facebook-common-4.34.0.aar Download https://jcenter.bintray.com/com/facebook/android/facebook-login/4.34.0/facebook-login-4.34.0.aar Download https://jcenter.bintray.com/com/facebook/android/facebook-share/4.34.0/facebook-share-4.34.0.aar Download https://jcenter.bintray.com/com/facebook/android/facebook-places/4.34.0/facebook-places-4.34.0.aar Download https://jcenter.bintray.com/com/facebook/android/facebook-applinks/4.34.0/facebook-applinks-4.34.0.aar Download https://jcenter.bintray.com/com/facebook/android/facebook-messenger/4.34.0/facebook-messenger-4.34.0.aar Download https://jcenter.bintray.com/com/facebook/android/facebook-marketing/4.34.0/facebook-marketing-4.34.0.aar Download https://jcenter.bintray.com/com/facebook/android/facebook-android-sdk/4.34.0/facebook-android-sdk-4.34.0.aar FAILURE: Build failed with an exception. * What went wrong: A problem occurred configuring root project 'android'. > BUILD FAILED Total time: 43.009 secs Could not find play-services-auth-base-license.aar (com.google.android.gms:play-services-auth-base-license:11.8.0). Searched in the following locations: https://jcenter.bintray.com/com/google/android/gms/play-services-auth-base-license/11.8.0/play-services-auth-base-license-11.8.0.aar * Try: Run with --stacktrace option to get the stack trace. Run with --info or --debug option to get more log output. (node:11696) UnhandledPromiseRejectionWarning: Error: cmd: Command failed with exit code 1 Error output: FAILURE: Build failed with an exception. * What went wrong: A problem occurred configuring root project 'android'. > Could not find play-services-auth-base-license.aar (com.google.android.gms:play-services-auth-base-license:11.8.0). Searched in the following locations: https://jcenter.bintray.com/com/google/android/gms/play-services-auth-base-license/11.8.0/play-services-auth-base-license-11.8.0.aar * Try: Run with --stacktrace option to get the stack trace. Run with --info or --debug option to get more log output. at ChildProcess.whenDone (D:\-\DevMobi\wplms\qimoves\platforms\android\cordova\node_modules\cordova-common\src\superspawn.js:169:23) at emitTwo (events.js:126:13) at ChildProcess.emit (events.js:214:7) at maybeClose (internal/child_process.js:925:16) at Process.ChildProcess._handle.onexit (internal/child_process.js:209:5) (node:11696) UnhandledPromiseRejectionWarning: Unhandled promise rejection. This error originated either by throwing inside of an async function without a catch block, or by rejecting a promise which was not handled with .catch(). (rejection id: 1) (node:11696) [DEP0018] DeprecationWarning: Unhandled promise rejections are deprecated. In the future, promise rejections that are not handled will terminate the Node.js process with a non-zero exit code. D:\-\DevMobi\wplms\qimoves>
 

izmir escort

antalya escort

izmir escort

antalya escort

izmir escort

bursa escort

porno izle

porno izle

porno izle

escort istanbul