WordPress LMS for Web and mobile Forums Ionic App Support App build Android problem Reply To: App build Android problem

Reply To: App build Android problem

WordPress LMS for Web and mobile Forums Ionic App Support App build Android problem Reply To: App build Android problem

#12814

sudong
Participant
  FAILURE: Build failed with an exception.   * What went wrong: Execution failed for task ':app:compileDebugJavaWithJavac'. > Compilation failed; see the compiler error output for details.   * Try: Run with --stacktrace option to get the stack trace. Run with --info or --debug option to get more l og output. 27 actionable tasks: 7 executed, 20 up-to-date   * Get more help at https://help.gradle.org   BUILD FAILED in 39s (node:5340) UnhandledPromiseRejectionWarning: Error: cmd: Command failed with exit code 1 Error outp ut: D:\WenYi\App\6.6\wplms\platforms\android\app\src\main\java\com\alexdisler\inapppurchases\IabHelper.j ava:33: ����: �����com.android.vending.billing������ import com.android.vending.billing.IInAppBillingService; ^ D:\WenYi\App\6.6\wplms\platforms\android\app\src\main\java\com\alexdisler\inapppurchases\IabHelper.j ava:103: ����: �Ҳ������� IInAppBillingService mService; ^ ����:   �� IInAppBillingService λ��: �� IabHelper D:\WenYi\App\6.6\wplms\platforms\android\app\src\main\java\com\alexdisler\inapppurchases\IabHelper.j ava:230: ����: �����IInAppBillingService������ mService = IInAppBillingService.Stub.asInterface(service); ^ ע: ijЩ�����ļ�ʹ�û�����ѹ�ʱ�� API�� ע: �й���ϸ��Ϣ, ��ʹ�� -Xlint:deprecation ���±��롣 ע: ijЩ�����ļ�ʹ����δ�������ȫ�IJ����� ע: �й���ϸ��Ϣ, ��ʹ�� -Xlint:unchecked ���±��롣 3 ������   FAILURE: Build failed with an exception.   * What went wrong: Execution failed for task ':app:compileDebugJavaWithJavac'. > Compilation failed; see the compiler error output for details.   * Try: Run with --stacktrace option to get the stack trace. Run with --info or --debug option to get more l og output.   * Get more help at https://help.gradle.org   BUILD FAILED in 39s at ChildProcess.whenDone (D:\WenYi\App\6.6\wplms\platforms\android\cordova\node_modules\cordova- common\src\superspawn.js:169:23) at emitTwo (events.js:126:13) at ChildProcess.emit (events.js:214:7) at maybeClose (internal/child_process.js:925:16) at Process.ChildProcess._handle.onexit (internal/child_process.js:209:5) (node:5340) UnhandledPromiseRejectionWarning: Unhandled promise rejection. This error originated eit her by throwing inside of an async function without a catch block, or by rejecting a promise which w as not handled with .catch(). (rejection id: 1) (node:5340) [DEP0018] DeprecationWarning: Unhandled promise rejections are deprecated. In the future , promise rejections that are not handled will terminate the Node.js process with a non-zero exit co de.     I had this problem again... I felt like I was back to my original problem. I really want to build my app. Can you help me to solve? Thanks very much

izmir escort

antalya escort

izmir escort

antalya escort

izmir escort

bursa escort

porno izle

porno izle

porno izle

escort istanbul