Reply To: Typescript Error

#37774

tschipunza
Participant

D8: Program type already present: com.google.zxing.BarcodeFormat

FAILURE: Build failed with an exception.

* What went wrong:
Execution failed for task ‘:app:transformDexArchiveWithExternalLibsDexMergerForDebug’.
> com.android.builder.dexing.DexArchiveMergerException: Error while merging dex archives:
Program type already present: com.google.zxing.BarcodeFormat
Learn how to resolve the issue at https://developer.android.com/studio/build/dependencies#duplicate_classes.

* Try:
Run with –stacktrace option to get the stack trace. Run with –info or –debug option to get more log output. Run with –scan to get full insights.

* Get more help at https://help.gradle.org

BUILD FAILED in 22s
[ERROR] An error occurred while running subprocess cordova.

cordova.cmd build android exited with exit code 1.

Re-running this command with the –verbose flag may provide more information.