Reply To: CANNOT GET ERROR

#44091

waqas shah
Participant

Ok I have followed your insttruction and now i am getting these errors :

C:\Users\vickky>ionic start kurdemy blank –type=ionic-angular
? You are already in an Ionic project directory. Do you really want to start another project here? Yes
√ Preparing directory .\kurdemy – done!
√ Downloading and extracting blank starter – done!

Installing dependencies may take several minutes.

──────────────────────────────────────────────────────────────

Ionic Appflow, the mobile DevOps solution by Ionic

Continuously build, deploy, and ship apps
Focus on building apps while we automate the rest

Learn more: https://ion.link/appflow

──────────────────────────────────────────────────────────────

> npm.cmd i
npm WARN deprecated [email protected]: Please migrate to Workbox: https://developers.google.com/web/tools/workbox/guides/migrations/migrate-from-sw
npm WARN deprecated [email protected]: This package has been deprecated and is no longer maintained. Please use @rollup/plugin-commonjs.
npm WARN deprecated [email protected]: This package has been deprecated and is no longer maintained. Please use @rollup/plugin-node-resolve.
npm WARN deprecated [email protected].3: Browserslist 2 could fail on reading Browserslist >3.0 config used in other tools.

> [email protected].1 install C:\Users\vickky\kurdemy\node_modules\node-sass
> node scripts/install.js

Downloading binary from https://github.com/sass/node-sass/releases/download/v4.13.1/win32-x64-64_binding.node
Cannot download “https://github.com/sass/node-sass/releases/download/v4.13.1/win32-x64-64_binding.node”:

ESOCKETTIMEDOUT

Hint: If github.com is not accessible in your location
try setting a proxy via HTTP_PROXY, e.g.

export HTTP_PROXY=http://example.com:1234

or configure npm proxy via

npm config set proxy http://example.com:8080

> [email protected] postinstall C:\Users\vickky\kurdemy\node_modules\uglifyjs-webpack-plugin
> node lib/post_install.js

> [email protected].1 postinstall C:\Users\vickky\kurdemy\node_modules\node-sass
> node scripts/build.js

Building: C:\Program Files\nodejs\node.exe C:\Users\vickky\kurdemy\node_modules\node-gyp\bin\node-gyp.js rebuild –verbose –libsass_ext= –libsass_cflags= –libsass_ldflags= –libsass_library=
gyp info it worked if it ends with ok
gyp verb cli [ ‘C:\\Program Files\\nodejs\\node.exe’,
gyp verb cli ‘C:\\Users\\vickky\\kurdemy\\node_modules\\node-gyp\\bin\\node-gyp.js’,
gyp verb cli ‘rebuild’,
gyp verb cli ‘–verbose’,
gyp verb cli ‘–libsass_ext=’,
gyp verb cli ‘–libsass_cflags=’,
gyp verb cli ‘–libsass_ldflags=’,
gyp verb cli ‘–libsass_library=’ ]
gyp info using [email protected]
gyp info using [email protected].0 | win32 | x64
gyp verb command rebuild []
gyp verb command clean []
gyp verb clean removing “build” directory
gyp verb command configure []
gyp verb check python checking for Python executable “python2” in the PATH
gyp verb which failed Error: not found: python2
gyp verb which failed at getNotFoundError (C:\Users\vickky\kurdemy\node_modules\which\which.js:13:12)
gyp verb which failed at F (C:\Users\vickky\kurdemy\node_modules\which\which.js:68:19)
gyp verb which failed at E (C:\Users\vickky\kurdemy\node_modules\which\which.js:80:29)
gyp verb which failed at C:\Users\vickky\kurdemy\node_modules\which\which.js:89:16
gyp verb which failed at C:\Users\vickky\kurdemy\node_modules\isexe\index.js:42:5
gyp verb which failed at C:\Users\vickky\kurdemy\node_modules\isexe\windows.js:36:5
gyp verb which failed at FSReqWrap.oncomplete (fs.js:153:21)
gyp verb which failed python2 { Error: not found: python2
gyp verb which failed at getNotFoundError (C:\Users\vickky\kurdemy\node_modules\which\which.js:13:12)
gyp verb which failed at F (C:\Users\vickky\kurdemy\node_modules\which\which.js:68:19)
gyp verb which failed at E (C:\Users\vickky\kurdemy\node_modules\which\which.js:80:29)
gyp verb which failed at C:\Users\vickky\kurdemy\node_modules\which\which.js:89:16
gyp verb which failed at C:\Users\vickky\kurdemy\node_modules\isexe\index.js:42:5
gyp verb which failed at C:\Users\vickky\kurdemy\node_modules\isexe\windows.js:36:5
gyp verb which failed at FSReqWrap.oncomplete (fs.js:153:21)
gyp verb which failed stack:
gyp verb which failed ‘Error: not found: python2\n at getNotFoundError (C:\\Users\\vickky\\kurdemy\\node_modules\\which\\which.js:13:12)\n at F (C:\\Users\\vickky\\kurdemy\\node_modules\\which\\which.js:68:19)\n at E (C:\\Users\\vickky\\kurdemy\\node_modules\\which\\which.js:80:29)\n at C:\\Users\\vickky\\kurdemy\\node_modules\\which\\which.js:89:16\n at C:\\Users\\vickky\\kurdemy\\node_modules\\isexe\\index.js:42:5\n at C:\\Users\\vickky\\kurdemy\\node_modules\\isexe\\windows.js:36:5\n at FSReqWrap.oncomplete (fs.js:153:21)’,
gyp verb which failed code: ‘ENOENT’ }
gyp verb check python checking for Python executable “python” in the PATH
gyp verb which failed Error: not found: python
gyp verb which failed at getNotFoundError (C:\Users\vickky\kurdemy\node_modules\which\which.js:13:12)
gyp verb which failed at F (C:\Users\vickky\kurdemy\node_modules\which\which.js:68:19)
gyp verb which failed at E (C:\Users\vickky\kurdemy\node_modules\which\which.js:80:29)
gyp verb which failed at C:\Users\vickky\kurdemy\node_modules\which\which.js:89:16
gyp verb which failed at C:\Users\vickky\kurdemy\node_modules\isexe\index.js:42:5
gyp verb which failed at C:\Users\vickky\kurdemy\node_modules\isexe\windows.js:36:5
gyp verb which failed at FSReqWrap.oncomplete (fs.js:153:21)
gyp verb which failed python { Error: not found: python
gyp verb which failed at getNotFoundError (C:\Users\vickky\kurdemy\node_modules\which\which.js:13:12)
gyp verb which failed at F (C:\Users\vickky\kurdemy\node_modules\which\which.js:68:19)
gyp verb which failed at E (C:\Users\vickky\kurdemy\node_modules\which\which.js:80:29)
gyp verb which failed at C:\Users\vickky\kurdemy\node_modules\which\which.js:89:16
gyp verb which failed at C:\Users\vickky\kurdemy\node_modules\isexe\index.js:42:5
gyp verb which failed at C:\Users\vickky\kurdemy\node_modules\isexe\windows.js:36:5
gyp verb which failed at FSReqWrap.oncomplete (fs.js:153:21)
gyp verb which failed stack:
gyp verb which failed ‘Error: not found: python\n at getNotFoundError (C:\\Users\\vickky\\kurdemy\\node_modules\\which\\which.js:13:12)\n at F (C:\\Users\\vickky\\kurdemy\\node_modules\\which\\which.js:68:19)\n at E (C:\\Users\\vickky\\kurdemy\\node_modules\\which\\which.js:80:29)\n at C:\\Users\\vickky\\kurdemy\\node_modules\\which\\which.js:89:16\n at C:\\Users\\vickky\\kurdemy\\node_modules\\isexe\\index.js:42:5\n at C:\\Users\\vickky\\kurdemy\\node_modules\\isexe\\windows.js:36:5\n at FSReqWrap.oncomplete (fs.js:153:21)’,
gyp verb which failed code: ‘ENOENT’ }
gyp verb could not find “python”. checking python launcher
gyp verb could not find “python”. guessing location
gyp verb ensuring that file exists: C:\Python27\python.exe
gyp ERR! configure error
gyp ERR! stack Error: Can’t find Python executable “python”, you can set the PYTHON env variable.
gyp ERR! stack at PythonFinder.failNoPython (C:\Users\vickky\kurdemy\node_modules\node-gyp\lib\configure.js:484:19)
gyp ERR! stack at PythonFinder.<anonymous> (C:\Users\vickky\kurdemy\node_modules\node-gyp\lib\configure.js:509:16)
gyp ERR! stack at callback (C:\Users\vickky\kurdemy\node_modules\graceful-fs\polyfills.js:295:20)
gyp ERR! stack at FSReqWrap.oncomplete (fs.js:153:21)
gyp ERR! System Windows_NT 10.0.18363
gyp ERR! command “C:\\Program Files\\nodejs\\node.exe” “C:\\Users\\vickky\\kurdemy\\node_modules\\node-gyp\\bin\\node-gyp.js” “rebuild” “–verbose” “–libsass_ext=” “–libsass_cflags=” “–libsass_ldflags=” “–libsass_library=”
gyp ERR! cwd C:\Users\vickky\kurdemy\node_modules\node-sass
gyp ERR! node -v v10.16.0
gyp ERR! node-gyp -v v3.8.0
gyp ERR! not ok
Build failed with error code: 1
npm WARN optional SKIPPING OPTIONAL DEPENDENCY: [email protected] (node_modules\fsevents):
npm WARN notsup SKIPPING OPTIONAL DEPENDENCY: Unsupported platform for [email protected]: wanted {“os”:”darwin”,”arch”:”any”} (current: {“os”:”win32″,”arch”:”x64″})

npm ERR! code ELIFECYCLE
npm ERR! errno 1
npm ERR! [email protected].1 postinstall: node scripts/build.js
npm ERR! Exit status 1
npm ERR!
npm ERR! Failed at the [email protected].1 postinstall script.
npm ERR! This is probably not a problem with npm. There is likely additional logging output above.

npm ERR! A complete log of this run can be found in:
npm ERR! C:\Users\vickky\AppData\Roaming\npm-cache\_logs\2020-02-07T14_25_59_360Z-debug.log
[ERROR] An error occurred while running subprocess npm.

npm.cmd i exited with exit code 1.

Re-running this command with the –verbose flag may provide more information.

C:\Users\vickky>