WordPress LMS for Web and mobile Forums Ionic App Support error while running the purchased app after following video tutorial Reply To: error while running the purchased app after following video tutorial

Reply To: error while running the purchased app after following video tutorial

WordPress LMS for Web and mobile Forums Ionic App Support error while running the purchased app after following video tutorial Reply To: error while running the purchased app after following video tutorial

#57002

punithb
Participant

Failed to compile.

./src/theme/variables.scss (./node_modules/css-loader/dist/cjs.js??ref–13-1!./node_modules/postcss-loader/src??embedded!./node_modules/sass-loader/dist/cjs.js??ref–13-3!./src/theme/variables.scss)
Module build failed (from ./node_modules/sass-loader/dist/cjs.js):
SassError: Can’t find stylesheet to import.

5 │ @import “ionic.globals”;
│ ^^^^^^^^^^^^^^^

D:\ionic\wplms\src\theme\variables.scss 5:9 root stylesheet