Cannot GET/

Viewing 11 posts - 1 through 11 (of 11 total)
  • Author
    Posts
  • #34877

    Robel Mehari
    Participant

    I just purchased the APP and downloaded it, and i followed every single steps you provided. When i extracted the download file from theme forest i got only two files (not like yours) 1 is _MACOSX and the second is ionic_src

    inside the _MACOSX there is only one file ._config,

    inside the ionic_src there is src filder and config.xml.

    the issue am facing is this.

    Installing necessary packages the first command is not working it says 

    <span style=”color: #444444; font-family: Poppins;”>npm ERR! code EINVALIDTAGNAME</span>

    <span style=”color: #444444; font-family: Poppins;”>npm ERR! Invalid tag name “ng2–dragula”: Tags may not have any characters that encodeURIComponent encodes.</span>

    <span style=”color: #444444; font-family: Poppins;”> </span>

    <span style=”color: #444444; font-family: Poppins;”>npm ERR! A complete log of this run can be found in:</span>

    <span style=”color: #444444; font-family: Poppins;”>npm ERR!     C:\Users\computer name\AppData\Roaming\npm-cache\_logs\2019-09-29T18_17_59_618Z-debug.log</span>

    <span style=”color: #444444; font-family: Poppins;”>PS D:\doc\ionic\Projectname></span>

    when i finished all the steps you recommended and tried to run the following command (ionic serve) in the command line says this

    > ng.cmd run app:serve –host=localhost –port=8100

    [ng] i 「wds」: Project is running at http://localhost:8100/webpack-dev-server/

    [ng] i 「wds」: webpack output is served from /

    [ng] i 「wds」: 404s will fallback to //index.html

    [ng] chunk {main} main.js, main.js.map (main) 1.88 kB [initial] [rendered]

    [ng] chunk {polyfills} polyfills.js, polyfills.js.map (polyfills) 149 kB [initial] [rendered]

    [ng] chunk {runtime} runtime.js, runtime.js.map (runtime) 6.09 kB [entry] [rendered]

    [ng] chunk {styles} styles.js, styles.js.map (styles) 16.7 kB [initial] [rendered]

    [ng] chunk {vendor} vendor.js, vendor.js.map (vendor) 339 kB [initial] [rendered]

    [ng] Date: 2019-09-29T18:23:48.968Z – Hash: ed76136fbce926a33675 – Time: 3107ms

    [ng]

    [ng] ERROR in ./src/theme/variables.scss (./node_modules/@angular-devkit/build-angular/src/angular-cli-files/plugins/raw-css-loader.js!./node_modules/postcss-loader/src??embedded!./node_modules/sass-loader/lib/loader.js??ref–15-3!./src/theme/variables.scss)

    [ng] Module build failed (from ./node_modules/sass-loader/lib/loader.js):

    [ng] undefined

    [ng] ^

    [ng]       File to import not found or unreadable: ionic.globals.

    [ng]       in D:\doc\ionic\Projectname\src\theme\variables.scss (line 5, column 1)

    [ng] ERROR in multi ./src/theme/variables.scss ./src/global.scss

    [ng] Module not found: Error: Can’t resolve ‘D:\doc\ionic\Projectname\src\global.scss’ in ‘D:\doc\ionic\Projectname’

    [ng] ERROR in multi (webpack)-dev-server/client?http://0.0.0.0:0/sockjs-node&sockPath=/sockjs-node ./src/main.ts

    [ng] Module not found: Error: Can’t resolve ‘D:\doc\ionic\Projectname\src\main.ts’ in ‘D:\doc\ionic\Projectname’

    [ng] ERROR in multi ./src/polyfills.ts ./node_modules/@angular-devkit/build-angular/src/angular-cli-files/models/jit-polyfills.js

    [ng] Module not found: Error: Can’t resolve ‘D:\doc\ionic\Projectname\src\polyfills.ts’ in ‘D:\doc\ionic\Projectname’

    [ng] ERROR in Must have a source file to refactor.

    the browser just print out (Cannot GET/)

    please need help, i will wait for your guide.

     

    #35038

    Alex
    Participant

    Similar problem, when i write Ionic Server i get the next error

    [ng] ERROR in multi ./src/theme/variables.scss ./src/global.scss

    [ng] Module not found: Error: Can’t resolve ‘C:\Escala\src\global.scss’ in ‘C:\Escala’

    [ng] ERROR in multi (webpack)-dev-server/client?http://0.0.0.0:0/sockjs-node&sockPath=/sockjs-node ./src/main.ts

    [ng] Module not found: Error: Can’t resolve ‘C:\Escala\src\main.ts’ in ‘C:\Escala’

    [ng] ERROR in multi ./src/polyfills.ts ./node_modules/@angular-devkit/build-angular/src/angular-cli-files/models/jit-polyfills.js

    [ng] Module not found: Error: Can’t resolve ‘C:\Escala\src\polyfills.ts’ in ‘C:\Escala’

    [ng] ERROR in multi ./src/theme/variables.scss ./src/global.scss

    [ng] Module not found: Error: Can’t resolve ‘C:\Escala\src\theme\variables.scss’ in ‘C:\Escala’

    [ng] ERROR in Must have a source file to refactor.

    #35058

    Scott Lang
    Keymaster

    Hi,

    It appears like there is some version or dependency missing.

    We are sharing our details which we use to configure our app: https://gist.githubusercontent.com/shubham-99fusion/afff746f96aff17cad7fa34aa6c00e0c/raw/2bcabecfe5af7652605511ce0a3bd10f4e908eea/ionic_info10_1_19

    Here is our package.json file: https://we.tl/t-fNcuOP8Rik

    #35121

    Robel Mehari
    Participant

    Hi,

    Can you tell where this package.json should be placed

    #35397

    Scott Lang
    Keymaster

    Hi,

    Package.json will go to root of your project refer this : http://prntscr.com/peo6wc

    #35715

    Robel Mehari
    Participant

    Hello,

    This app is not working something is not right about it, tried so many times not working, i still get the same error. by the way the the package is there.

    #35785

    Scott Lang
    Keymaster

    Hi,

    Basically you have to do: http://prntscr.com/pgx3ic

    Here is the instruction you have to follow. Also, you can follow this tutorial: https://wplms.io/course/getting-started-with-wplms-mobile-app

    #35892

    Robel Mehari
    Participant

    here is how i did it,

    first installed

    Java -git-Nod.js-angular-ionic, all from the url was provided in the course.

    created a folder called Doc>ionic. and then run the command ionic start MyApp -vs2 tabs, here i got option to choose take a look https://prnt.sc/phhvsw. i chose tabs, and installed the following http://prnt.sc/phhx3q, i unzipped  the app from codecanyon got this http://prnt.sc/phi4nq copied the ionic_src to the project and renamed it to src. created a new app in my website copied the ID, opened the project>scr>>services>Config.ts replaced  the url and the id saved it. when i test ionic serve it gives me the cannot get error.

     

    #46401

    Kenedy
    Participant

    After many tries, I am getting now this:

    C:\Users\Kenedy\Documents\ionic\projectname>ionic serve
    > ng.cmd run app:serve –host=localhost –port=8100
    [ng] i 「wds」: Project is running at http://localhost:8100/webpack-dev-server/
    [ng] i 「wds」: webpack output is served from /
    [ng] i 「wds」: 404s will fallback to //index.html
    [ng] chunk {main} main.js, main.js.map (main) 2.02 kB [initial] [rendered]
    [ng] chunk {polyfills} polyfills.js, polyfills.js.map (polyfills) 154 kB [initial] [rendered]
    [ng] chunk {runtime} runtime.js, runtime.js.map (runtime) 6.15 kB [entry] [rendered]
    [ng] chunk {styles} styles.js, styles.js.map (styles) 117 kB [initial] [rendered]
    [ng] chunk {vendor} vendor.js, vendor.js.map (vendor) 340 kB [initial] [rendered]
    [ng] Date: 2020-03-14T01:41:29.038Z – Hash: 7d660078dcb1d275e471 – Time: 7964ms
    [ng]
    [ng] ERROR in src/app/app.component.ts:40:6 – error TS2554: Expected 2 arguments, but got 1.
    [ng] 40 @ViewChild(‘nav’) nav: NavController;
    [ng] ~~~~~~~~~~~~~~~~
    [ng] node_modules/@angular/core/core.d.ts:7888:47
    [ng] 7888 (selector: Type<any> | Function | string, opts: {
    [ng] ~~~~~~~
    [ng] 7889 read?: any;
    [ng] ~~~~~~~~~~~~~~~~~~~
    [ng] 7890 static: boolean;
    [ng] ~~~~~~~~~~~~~~~~~~~~~~~~
    [ng] 7891 }): any;
    [ng] ~~~~~
    [ng] An argument for ‘opts’ was not provided.
    [ng] src/app/app.component.ts:40:28 – error TS2709: Cannot use namespace ‘NavController’ as a type.
    [ng] 40 @ViewChild(‘nav’) nav: NavController;
    [ng] ~~~~~~~~~~~~~
    [ng] src/app/app.component.ts:43:27 – error TS2709: Cannot use namespace ‘Platform’ as a type.
    [ng] 43 private platform: Platform,
    [ng] ~~~~~~~~
    [ng] src/app/app.component.ts:44:27 – error TS2709: Cannot use namespace ‘MenuController’ as a type.
    [ng] 44 private menuCtrl: MenuController,
    [ng] ~~~~~~~~~~~~~~
    [ng] src/app/app.component.ts:45:30 – error TS2709: Cannot use namespace ‘LoadingController’ as a type.
    [ng] 45 private loadingCtrl: LoadingController,
    [ng] ~~~~~~~~~~~~~~~~~
    [ng] src/app/app.component.ts:46:22 – error TS2709: Cannot use namespace ‘App’ as a type.
    [ng] 46 private app: App,
    [ng] ~~~
    [ng] src/app/app.component.ts:50:30 – error TS2749: ‘SplashScreen’ refers to a value, but is being used as a type here.
    [ng] 50 public splashScreen: SplashScreen,
    [ng] ~~~~~~~~~~~~
    [ng] src/components/absolute-drag/absolute-drag.ts:12:88 – error TS2709: Cannot use namespace ‘DomController’ as a type.
    [ng] 12 constructor(public element: ElementRef, public renderer: Renderer, public domCtrl: DomController) {
    [ng] ~~~~~~~~~~~~~
    [ng] src/components/chatblock/chatblock.ts:15:19 – error TS2709: Cannot use namespace ‘NavController’ as a type.
    [ng] 15 public navCtrl: NavController,
    [ng] ~~~~~~~~~~~~~
    [ng] src/components/chatblock/chatblock.ts:16:21 – error TS2709: Cannot use namespace ‘NavParams’ as a type.
    [ng] 16 public navParams: NavParams,
    [ng] ~~~~~~~~~
    [ng] src/components/commentblock/commentblock.ts:25:32 – error TS2709: Cannot use namespace ‘NavController’ as a type.
    [ng] 25 constructor( public navCtrl: NavController,
    [ng] ~~~~~~~~~~~~~
    [ng] src/components/commentblock/commentblock.ts:26:24 – error TS2709: Cannot use namespace ‘AlertController’ as a type.
    [ng] 26 public alertCtrl:AlertController,
    [ng] ~~~~~~~~~~~~~~~
    [ng] src/components/courseblock/courseblock.ts:16:6 – error TS2554: Expected 2 arguments, but got 1.
    [ng] 16 @ViewChild(‘featured’) featured: ElementRef;
    [ng] ~~~~~~~~~~~~~~~~~~~~~
    [ng] node_modules/@angular/core/core.d.ts:7888:47
    [ng] 7888 (selector: Type<any> | Function | string, opts: {
    [ng] ~~~~~~~
    [ng] 7889 read?: any;
    [ng] ~~~~~~~~~~~~~~~~~~~
    [ng] 7890 static: boolean;
    [ng] ~~~~~~~~~~~~~~~~~~~~~~~~
    [ng] 7891 }): any;
    [ng] ~~~~~
    [ng] An argument for ‘opts’ was not provided.
    [ng] src/components/forumblock/forumblock.ts:17:19 – error TS2709: Cannot use namespace ‘NavController’ as a type.
    [ng] 17 public navCtrl: NavController,
    [ng] ~~~~~~~~~~~~~
    [ng] src/components/forumblock/forumblock.ts:18:21 – error TS2709: Cannot use namespace ‘NavParams’ as a type.
    [ng] 18 public navParams: NavParams,
    [ng] ~~~~~~~~~
    [ng] src/components/forumblock/forumblock.ts:21:32 – error TS2709: Cannot use namespace ‘LoadingController’ as a type.
    [ng] 21 public loadingController: LoadingController,
    [ng] ~~~~~~~~~~~~~~~~~
    [ng] src/components/forumblock/forumblock.ts:22:25 – error TS2709: Cannot use namespace ‘ToastController’ as a type.
    [ng] 22 private toastCtrl: ToastController,
    [ng] ~~~~~~~~~~~~~~~
    [ng] src/components/forumblock/forumblock.ts:23:25 – error TS2709: Cannot use namespace ‘AlertController’ as a type.
    [ng] 23 private alertCtrl: AlertController
    [ng] ~~~~~~~~~~~~~~~
    [ng] src/components/groupblock/groupblock.ts:19:19 – error TS2709: Cannot use namespace ‘NavController’ as a type.
    [ng] 19 public navCtrl: NavController,
    [ng] ~~~~~~~~~~~~~
    [ng] src/components/groupblock/groupblock.ts:20:21 – error TS2709: Cannot use namespace ‘NavParams’ as a type.
    [ng] 20 public navParams: NavParams,
    [ng] ~~~~~~~~~
    [ng] src/components/groupblock/groupblock.ts:24:32 – error TS2709: Cannot use namespace ‘LoadingController’ as a type.
    [ng] 24 public loadingController: LoadingController,
    [ng] ~~~~~~~~~~~~~~~~~
    [ng] src/components/groupblock/groupblock.ts:25:25 – error TS2709: Cannot use namespace ‘ToastController’ as a type.
    [ng] 25 private toastCtrl: ToastController,
    [ng] ~~~~~~~~~~~~~~~
    [ng] src/components/groupblock/groupblock.ts:26:25 – error TS2709: Cannot use namespace ‘AlertController’ as a type.
    [ng] 26 private alertCtrl: AlertController
    [ng] ~~~~~~~~~~~~~~~
    [ng] src/components/memberblock/memberblock.ts:17:19 – error TS2709: Cannot use namespace ‘NavController’ as a type.
    [ng] 17 public navCtrl: NavController,
    [ng] ~~~~~~~~~~~~~
    [ng] src/components/memberblock/memberblock.ts:18:21 – error TS2709: Cannot use namespace ‘NavParams’ as a type.
    [ng] 18 public navParams: NavParams,
    [ng] ~~~~~~~~~
    [ng] src/components/memberblock/memberblock.ts:20:32 – error TS2709: Cannot use namespace ‘LoadingController’ as a type.
    [ng] 20 public loadingController: LoadingController,
    [ng] ~~~~~~~~~~~~~~~~~
    [ng] src/components/memberblock/memberblock.ts:21:25 – error TS2709: Cannot use namespace ‘ToastController’ as a type.
    [ng] 21 private toastCtrl: ToastController,
    [ng] ~~~~~~~~~~~~~~~
    [ng] src/components/memberblock/memberblock.ts:22:25 – error TS2709: Cannot use namespace ‘AlertController’ as a type.
    [ng] 22 private alertCtrl: AlertController
    [ng] ~~~~~~~~~~~~~~~
    [ng] src/components/messageblock/messageblock.ts:13:19 – error TS2709: Cannot use namespace ‘NavController’ as a type.
    [ng] 13 public navCtrl: NavController,
    [ng] ~~~~~~~~~~~~~
    [ng] src/components/messageblock/messageblock.ts:14:21 – error TS2709: Cannot use namespace ‘NavParams’ as a type.
    [ng] 14 public navParams: NavParams,
    [ng] ~~~~~~~~~
    [ng] src/components/question/question.ts:26:33 – error TS2709: Cannot use namespace ‘DragulaService’ as a type.
    [ng] 26 private dragulaService: DragulaService,) {
    [ng] ~~~~~~~~~~~~~~
    [ng] src/components/replyblock/replyblock.ts:20:25 – error TS2709: Cannot use namespace ‘NavController’ as a type.
    [ng] 20 public navCtrl: NavController,
    [ng] ~~~~~~~~~~~~~
    [ng] src/components/replyblock/replyblock.ts:21:27 – error TS2709: Cannot use namespace ‘NavParams’ as a type.
    [ng] 21 public navParams: NavParams,
    [ng] ~~~~~~~~~
    [ng] src/components/replyblock/replyblock.ts:24:35 – error TS2709: Cannot use namespace ‘LoadingController’ as a type.
    [ng] 24 public loadingController: LoadingController,
    [ng] ~~~~~~~~~~~~~~~~~
    [ng] src/components/replyblock/replyblock.ts:25:28 – error TS2709: Cannot use namespace ‘ToastController’ as a type.
    [ng] 25 private toastCtrl: ToastController,
    [ng] ~~~~~~~~~~~~~~~
    [ng] src/components/replyblock/replyblock.ts:26:28 – error TS2709: Cannot use namespace ‘AlertController’ as a type.
    [ng] 26 private alertCtrl: AlertController
    [ng] ~~~~~~~~~~~~~~~
    [ng] src/components/timer/timer.ts:2:9 – error TS2305: Module ‘”C:/Users/Kenedy/Documents/ionic/projectname/node_modules/rxjs/Rx”‘ has no exported member ‘Observable’.
    [ng] 2 import {Observable} from ‘rxjs/Rx’;
    [ng] ~~~~~~~~~~
    [ng] src/components/topicblock/topicblock.ts:17:19 – error TS2709: Cannot use namespace ‘NavController’ as a type.
    [ng] 17 public navCtrl: NavController,
    [ng] ~~~~~~~~~~~~~
    [ng] src/components/topicblock/topicblock.ts:18:21 – error TS2709: Cannot use namespace ‘NavParams’ as a type.
    [ng] 18 public navParams: NavParams,
    [ng] ~~~~~~~~~
    [ng] src/components/topicblock/topicblock.ts:21:32 – error TS2709: Cannot use namespace ‘LoadingController’ as a type.
    [ng] 21 public loadingController: LoadingController,
    [ng] ~~~~~~~~~~~~~~~~~
    [ng] src/components/topicblock/topicblock.ts:22:25 – error TS2709: Cannot use namespace ‘ToastController’ as a type.
    [ng] 22 private toastCtrl: ToastController,
    [ng] ~~~~~~~~~~~~~~~
    [ng] src/components/topicblock/topicblock.ts:23:25 – error TS2709: Cannot use namespace ‘AlertController’ as a type.
    [ng] 23 private alertCtrl: AlertController
    [ng] ~~~~~~~~~~~~~~~
    [ng] src/components/video-gular/video-gular.ts:12:10 – error TS2709: Cannot use namespace ‘VgAPI’ as a type.
    [ng] 12 api: VgAPI;
    [ng] ~~~~~
    [ng] src/components/video-gular/video-gular.ts:26:24 – error TS2709: Cannot use namespace ‘VgAPI’ as a type.
    [ng] 26 onPlayerReady(api: VgAPI) {
    [ng] ~~~~~
    [ng] src/directives/lazy-load.directive.ts:12:10 – error TS2305: Module ‘”C:/Users/Kenedy/Documents/ionic/projectname/node_modules/rxjs/Subscription”‘ has no exported member ‘Subscription’.
    [ng] 12 import { Subscription } from ‘rxjs/Subscription’;
    [ng] ~~~~~~~~~~~~
    [ng] src/directives/longPress.directive.ts:9:19 – error TS2709: Cannot use namespace ‘Gesture’ as a type.
    [ng] 9 pressGesture: Gesture;
    [ng] ~~~~~~~
    [ng] src/directives/pinch-zoom.directive.ts:9:16 – error TS2709: Cannot use namespace ‘Gesture’ as a type.
    [ng] 9 pinchGesture: Gesture;
    [ng] ~~~~~~~
    [ng] src/pages/about/about.ts:11:31 – error TS2709: Cannot use namespace ‘NavController’ as a type.
    [ng] 11 constructor(public navCtrl: NavController) {
    [ng] ~~~~~~~~~~~~~
    [ng] src/pages/add-edit-unit-comment/add-edit-unit-comment.ts:23:32 – error TS2709: Cannot use namespace ‘NavController’ as a type.
    [ng] 23 constructor(public navCtrl: NavController, public navParams: NavParams,
    [ng] ~~~~~~~~~~~~~
    [ng] src/pages/add-edit-unit-comment/add-edit-unit-comment.ts:23:65 – error TS2709: Cannot use namespace ‘NavParams’ as a type.
    [ng] 23 constructor(public navCtrl: NavController, public navParams: NavParams,
    [ng] ~~~~~~~~~
    [ng] src/pages/attendance/attendance.ts:18:31 – error TS2709: Cannot use namespace ‘NavController’ as a type.
    [ng] 18 constructor(public navCtrl: NavController, public navParams: NavParams) {
    [ng] ~~~~~~~~~~~~~
    [ng] src/pages/attendance/attendance.ts:18:64 – error TS2709: Cannot use namespace ‘NavParams’ as a type.
    [ng] 18 constructor(public navCtrl: NavController, public navParams: NavParams) {
    [ng] ~~~~~~~~~
    [ng] src/pages/blog/blog.ts:24:21 – error TS2709: Cannot use namespace ‘NavController’ as a type.
    [ng] 24 public navCtrl: NavController,
    [ng] ~~~~~~~~~~~~~
    [ng] src/pages/blog/blog.ts:27:33 – error TS2709: Cannot use namespace ‘LoadingController’ as a type.
    [ng] 27 public loadingController: LoadingController,
    [ng] ~~~~~~~~~~~~~~~~~
    [ng] src/pages/blog/blog.ts:28:25 – error TS2709: Cannot use namespace ‘ModalController’ as a type.
    [ng] 28 private modalCtrl:ModalController
    [ng] ~~~~~~~~~~~~~~~
    [ng] src/pages/chat/chat.ts:12:10 – error TS2305: Module ‘”C:/Users/Kenedy/Documents/ionic/projectname/node_modules/rxjs/Observable”‘ has no exported member ‘Observable’.
    [ng] 12 import { Observable } from ‘rxjs/Observable’;
    [ng] ~~~~~~~~~~
    [ng] src/pages/chat/chat.ts:37:3 – error TS2554: Expected 2 arguments, but got 1.
    [ng] 37 @ViewChild(‘ChatTabs’) chatTabs: Slides;
    [ng] ~~~~~~~~~~~~~~~~~~~~~
    [ng] node_modules/@angular/core/core.d.ts:7888:47
    [ng] 7888 (selector: Type<any> | Function | string, opts: {
    [ng] ~~~~~~~
    [ng] 7889 read?: any;
    [ng] ~~~~~~~~~~~~~~~~~~~
    [ng] 7890 static: boolean;
    [ng] ~~~~~~~~~~~~~~~~~~~~~~~~
    [ng] 7891 }): any;
    [ng] ~~~~~
    [ng] An argument for ‘opts’ was not provided.
    [ng] src/pages/chat/chat.ts:37:35 – error TS2709: Cannot use namespace ‘Slides’ as a type.
    [ng] 37 @ViewChild(‘ChatTabs’) chatTabs: Slides;
    [ng] ~~~~~~
    [ng] src/pages/chat/chat.ts:38:3 – error TS2554: Expected 2 arguments, but got 1.
    [ng] 38 @ViewChild(‘ChatSlides’) chatSlides: Slides;
    [ng] ~~~~~~~~~~~~~~~~~~~~~~~
    [ng] node_modules/@angular/core/core.d.ts:7888:47
    [ng] 7888 (selector: Type<any> | Function | string, opts: {
    [ng] ~~~~~~~
    [ng] 7889 read?: any;
    [ng] ~~~~~~~~~~~~~~~~~~~
    [ng] 7890 static: boolean;
    [ng] ~~~~~~~~~~~~~~~~~~~~~~~~
    [ng] 7891 }): any;
    [ng] ~~~~~
    [ng] An argument for ‘opts’ was not provided.
    [ng] src/pages/chat/chat.ts:38:39 – error TS2709: Cannot use namespace ‘Slides’ as a type.
    [ng] 38 @ViewChild(‘ChatSlides’) chatSlides: Slides;
    [ng] ~~~~~~
    [ng] src/pages/chat/chat.ts:42:21 – error TS2709: Cannot use namespace ‘ToastController’ as a type.
    [ng] 42 private toastCtrl:ToastController,
    [ng] ~~~~~~~~~~~~~~~
    [ng] src/pages/chat/chat.ts:44:19 – error TS2709: Cannot use namespace ‘NavController’ as a type.
    [ng] 44 public navCtrl: NavController,
    [ng] ~~~~~~~~~~~~~
    [ng] src/pages/chat/chat.ts:45:21 – error TS2709: Cannot use namespace ‘NavParams’ as a type.
    [ng] 45 public navParams: NavParams,
    [ng] ~~~~~~~~~
    [ng] src/pages/chat/chat.ts:46:23 – error TS2709: Cannot use namespace ‘LoadingController’ as a type.
    [ng] 46 public loadingCtrl: LoadingController,
    [ng] ~~~~~~~~~~~~~~~~~
    [ng] src/pages/contact/contact.ts:22:24 – error TS2709: Cannot use namespace ‘ToastController’ as a type.
    [ng] 22 private toastCtrl:ToastController,
    [ng] ~~~~~~~~~~~~~~~
    [ng] src/pages/contact/contact.ts:23:24 – error TS2709: Cannot use namespace ‘ModalController’ as a type.
    [ng] 23 private modalCtrl:ModalController,
    [ng] ~~~~~~~~~~~~~~~
    [ng] src/pages/course-status/course-status.ts:76:7 – error TS2709: Cannot use namespace ‘VgAPI’ as a type.
    [ng] 76 api:VgAPI;
    [ng] ~~~~~
    [ng] src/pages/course-status/course-status.ts:80:4 – error TS2554: Expected 2 arguments, but got 1.
    [ng] 80 @ViewChild(‘CourseStatusItems’) courseStatusItems: Slides;
    [ng] ~~~~~~~~~~~~~~~~~~~~~~~~~~~~~~
    [ng] node_modules/@angular/core/core.d.ts:7888:47
    [ng] 7888 (selector: Type<any> | Function | string, opts: {
    [ng] ~~~~~~~
    [ng] 7889 read?: any;
    [ng] ~~~~~~~~~~~~~~~~~~~
    [ng] 7890 static: boolean;
    [ng] ~~~~~~~~~~~~~~~~~~~~~~~~
    [ng] 7891 }): any;
    [ng] ~~~~~
    [ng] An argument for ‘opts’ was not provided.
    [ng] src/pages/course-status/course-status.ts:80:54 – error TS2709: Cannot use namespace ‘Slides’ as a type.
    [ng] 80 @ViewChild(‘CourseStatusItems’) courseStatusItems: Slides;
    [ng] ~~~~~~
    [ng] src/pages/course-status/course-status.ts:81:4 – error TS2554: Expected 2 arguments, but got 1.
    [ng] 81 @ViewChild(‘QuizQuestions’) quizQuestions: Slides;
    [ng] ~~~~~~~~~~~~~~~~~~~~~~~~~~
    [ng] node_modules/@angular/core/core.d.ts:7888:47
    [ng] 7888 (selector: Type<any> | Function | string, opts: {
    [ng] ~~~~~~~
    [ng] 7889 read?: any;
    [ng] ~~~~~~~~~~~~~~~~~~~
    [ng] 7890 static: boolean;
    [ng] ~~~~~~~~~~~~~~~~~~~~~~~~
    [ng] 7891 }): any;
    [ng] ~~~~~
    [ng] An argument for ‘opts’ was not provided.
    [ng] src/pages/course-status/course-status.ts:81:46 – error TS2709: Cannot use namespace ‘Slides’ as a type.
    [ng] 81 @ViewChild(‘QuizQuestions’) quizQuestions: Slides;
    [ng] ~~~~~~
    [ng] src/pages/course-status/course-status.ts:82:4 – error TS2554: Expected 2 arguments, but got 1.
    [ng] 82 @ViewChild(Content) content: Content;
    [ng] ~~~~~~~~~~~~~~~~~~
    [ng] node_modules/@angular/core/core.d.ts:7888:47
    [ng] 7888 (selector: Type<any> | Function | string, opts: {
    [ng] ~~~~~~~
    [ng] 7889 read?: any;
    [ng] ~~~~~~~~~~~~~~~~~~~
    [ng] 7890 static: boolean;
    [ng] ~~~~~~~~~~~~~~~~~~~~~~~~
    [ng] 7891 }): any;
    [ng] ~~~~~
    [ng] An argument for ‘opts’ was not provided.
    [ng] src/pages/course-status/course-status.ts:82:32 – error TS2709: Cannot use namespace ‘Content’ as a type.
    [ng] 82 @ViewChild(Content) content: Content;
    [ng] ~~~~~~~
    [ng] src/pages/course-status/course-status.ts:84:33 – error TS2709: Cannot use namespace ‘NavController’ as a type.
    [ng] 84 constructor(public navCtrl: NavController, public navParams: NavParams,
    [ng] ~~~~~~~~~~~~~
    [ng] src/pages/course-status/course-status.ts:84:66 – error TS2709: Cannot use namespace ‘NavParams’ as a type.
    [ng] 84 constructor(public navCtrl: NavController, public navParams: NavParams,
    [ng] ~~~~~~~~~
    [ng] src/pages/course-status/course-status.ts:85:28 – error TS2709: Cannot use namespace ‘ModalController’ as a type.
    [ng] 85 private modalCtrl: ModalController,private alert:AlertController,
    [ng] ~~~~~~~~~~~~~~~
    [ng] src/pages/course-status/course-status.ts:85:58 – error TS2709: Cannot use namespace ‘AlertController’ as a type.
    [ng] 85 private modalCtrl: ModalController,private alert:AlertController,
    [ng] ~~~~~~~~~~~~~~~
    [ng] src/pages/course-status/course-status.ts:89:28 – error TS2709: Cannot use namespace ‘ToastController’ as a type.
    [ng] 89 private toastCtrl: ToastController,
    [ng] ~~~~~~~~~~~~~~~
    [ng] src/pages/course-status/course-status.ts:94:29 – error TS2709: Cannot use namespace ‘LoadingController’ as a type.
    [ng] 94 private loadingCtrl:LoadingController,
    [ng] ~~~~~~~~~~~~~~~~~
    [ng] src/pages/course-status/course-status.ts:97:22 – error TS2709: Cannot use namespace ‘InAppBrowser’ as a type.
    [ng] 97 private iab: InAppBrowser,
    [ng] ~~~~~~~~~~~~
    [ng] src/pages/course-status/course-status.ts:98:27 – error TS2709: Cannot use namespace ‘FileTransfer’ as a type.
    [ng] 98 private transfer: FileTransfer,
    [ng] ~~~~~~~~~~~~
    [ng] src/pages/course-status/course-status.ts:100:30 – error TS2709: Cannot use namespace ‘FileTransferObject’ as a type.
    [ng] 100 public fileTransfer: FileTransferObject) {
    [ng] ~~~~~~~~~~~~~~~~~~
    [ng] src/pages/course-status/course-status.ts:816:23 – error TS2709: Cannot use namespace ‘VgAPI’ as a type.
    [ng] 816 onPlayerReady(api:VgAPI) {
    [ng] ~~~~~
    [ng] src/pages/course-status/course-status.ts:880:63 – error TS2339: Property ‘dataDirectory’ does not exist on type ‘File’.
    [ng] 880 this.fileTransfer.download(url, this.file.dataDirectory + name).then((entry) => {
    [ng] ~~~~~~~~~~~~~
    [ng] src/pages/course-status/course-status.ts:919:63 – error TS2339: Property ‘dataDirectory’ does not exist on type ‘File’.
    [ng] 919 this.fileTransfer.download(url, this.file.dataDirectory + name).then((entry) => {
    [ng] ~~~~~~~~~~~~~
    [ng] src/pages/course/course.ts:32:9 – error TS2709: Cannot use namespace ‘VgAPI’ as a type.
    [ng] 32 api:VgAPI;
    [ng] ~~~~~
    [ng] src/pages/course/course.ts:46:6 – error TS2554: Expected 2 arguments, but got 1.
    [ng] 46 @ViewChild(‘CourseTabs’) courseTabs: Slides;
    [ng] ~~~~~~~~~~~~~~~~~~~~~~~
    [ng] node_modules/@angular/core/core.d.ts:7888:47
    [ng] 7888 (selector: Type<any> | Function | string, opts: {
    [ng] ~~~~~~~
    [ng] 7889 read?: any;
    [ng] ~~~~~~~~~~~~~~~~~~~
    [ng] 7890 static: boolean;
    [ng] ~~~~~~~~~~~~~~~~~~~~~~~~
    [ng] 7891 }): any;
    [ng] ~~~~~
    [ng] An argument for ‘opts’ was not provided.
    [ng] src/pages/course/course.ts:46:42 – error TS2709: Cannot use namespace ‘Slides’ as a type.
    [ng] 46 @ViewChild(‘CourseTabs’) courseTabs: Slides;
    [ng] ~~~~~~
    [ng] src/pages/course/course.ts:47:6 – error TS2554: Expected 2 arguments, but got 1.
    [ng] 47 @ViewChild(‘CourseSlides’) courseSlides: Slides;
    [ng] ~~~~~~~~~~~~~~~~~~~~~~~~~
    [ng] node_modules/@angular/core/core.d.ts:7888:47
    [ng] 7888 (selector: Type<any> | Function | string, opts: {
    [ng] ~~~~~~~
    [ng] 7889 read?: any;
    [ng] ~~~~~~~~~~~~~~~~~~~
    [ng] 7890 static: boolean;
    [ng] ~~~~~~~~~~~~~~~~~~~~~~~~
    [ng] 7891 }): any;
    [ng] ~~~~~
    [ng] An argument for ‘opts’ was not provided.
    [ng] src/pages/course/course.ts:47:46 – error TS2709: Cannot use namespace ‘Slides’ as a type.
    [ng] 47 @ViewChild(‘CourseSlides’) courseSlides: Slides;
    [ng] ~~~~~~
    [ng] src/pages/course/course.ts:53:33 – error TS2709: Cannot use namespace ‘NavController’ as a type.
    [ng] 53 constructor(public navCtrl: NavController,
    [ng] ~~~~~~~~~~~~~
    [ng] src/pages/course/course.ts:54:25 – error TS2709: Cannot use namespace ‘NavParams’ as a type.
    [ng] 54 public navParams: NavParams,
    [ng] ~~~~~~~~~
    [ng] src/pages/course/course.ts:55:24 – error TS2709: Cannot use namespace ‘ModalController’ as a type.
    [ng] 55 public modalCtrl:ModalController,
    [ng] ~~~~~~~~~~~~~~~
    [ng] src/pages/course/course.ts:57:24 – error TS2709: Cannot use namespace ‘Platform’ as a type.
    [ng] 57 public platform: Platform,
    [ng] ~~~~~~~~
    [ng] src/pages/course/course.ts:61:25 – error TS2709: Cannot use namespace ‘ToastController’ as a type.
    [ng] 61 private toastCtrl:ToastController,
    [ng] ~~~~~~~~~~~~~~~
    [ng] src/pages/course/course.ts:62:27 – error TS2709: Cannot use namespace ‘LoadingController’ as a type.
    [ng] 62 private loadingCtrl:LoadingController,
    [ng] ~~~~~~~~~~~~~~~~~
    [ng] src/pages/course/course.ts:63:19 – error TS2709: Cannot use namespace ‘InAppBrowser’ as a type.
    [ng] 63 private iab:InAppBrowser,
    [ng] ~~~~~~~~~~~~
    [ng] src/pages/course/course.ts:65:26 – error TS2709: Cannot use namespace ‘AlertController’ as a type.
    [ng] 65 private alertCtrl: AlertController){}
    [ng] ~~~~~~~~~~~~~~~
    [ng] src/pages/course/course.ts:624:23 – error TS2709: Cannot use namespace ‘VgAPI’ as a type.
    [ng] 624 onPlayerReady(api:VgAPI) {
    [ng] ~~~~~
    [ng] src/pages/directory/directory.ts:15:10 – error TS2305: Module ‘”C:/Users/Kenedy/Documents/ionic/projectname/node_modules/rxjs/Observable”‘ has no exported member ‘Observable’.
    [ng] 15 import { Observable } from ‘rxjs/Observable’;
    [ng] ~~~~~~~~~~
    [ng] src/pages/directory/directory.ts:74:32 – error TS2709: Cannot use namespace ‘NavController’ as a type.
    [ng] 74 constructor(public navCtrl: NavController,
    [ng] ~~~~~~~~~~~~~
    [ng] src/pages/directory/directory.ts:76:27 – error TS2709: Cannot use namespace ‘NavParams’ as a type.
    [ng] 76 public navParams: NavParams,
    [ng] ~~~~~~~~~
    [ng] src/pages/directory/directory.ts:77:24 – error TS2709: Cannot use namespace ‘NavController’ as a type.
    [ng] 77 private nav: NavController,
    [ng] ~~~~~~~~~~~~~
    [ng] src/pages/directory/directory.ts:78:30 – error TS2709: Cannot use namespace ‘ModalController’ as a type.
    [ng] 78 private modalCtrl: ModalController,
    [ng] ~~~~~~~~~~~~~~~
    [ng] src/pages/directory/directory.ts:82:31 – error TS2709: Cannot use namespace ‘LoadingController’ as a type.
    [ng] 82 public loadingCtrl: LoadingController
    [ng] ~~~~~~~~~~~~~~~~~
    [ng] src/pages/directory/directory.ts:180:41 – error TS2339: Property ‘debounceTime’ does not exist on type ‘Observable<any>’.
    [ng] 180 this.searchControl.valueChanges.debounceTime(700).subscribe(search => {
    [ng] ~~~~~~~~~~~~
    [ng] src/pages/forumdirectory/forumdirectory.ts:5:10 – error TS2305: Module ‘”C:/Users/Kenedy/Documents/ionic/projectname/node_modules/rxjs/Observable”‘ has no exported member ‘Observable’.
    [ng] 5 import { Observable } from ‘rxjs/Observable’;
    [ng] ~~~~~~~~~~
    [ng] src/pages/forumdirectory/forumdirectory.ts:35:33 – error TS2709: Cannot use namespace ‘NavController’ as a type.
    [ng] 35 constructor(public navCtrl: NavController,
    [ng] ~~~~~~~~~~~~~
    [ng] src/pages/forumdirectory/forumdirectory.ts:38:27 – error TS2709: Cannot use namespace ‘NavParams’ as a type.
    [ng] 38 public navParams: NavParams,
    [ng] ~~~~~~~~~
    [ng] src/pages/forumdirectory/forumdirectory.ts:39:22 – error TS2709: Cannot use namespace ‘NavController’ as a type.
    [ng] 39 private nav: NavController,
    [ng] ~~~~~~~~~~~~~
    [ng] src/pages/forumdirectory/forumdirectory.ts:40:28 – error TS2709: Cannot use namespace ‘ToastController’ as a type.
    [ng] 40 private toastCtrl: ToastController,
    [ng] ~~~~~~~~~~~~~~~
    [ng] src/pages/forumdirectory/forumdirectory.ts:41:29 – error TS2709: Cannot use namespace ‘LoadingController’ as a type.
    [ng] 41 public loadingCtrl: LoadingController
    [ng] ~~~~~~~~~~~~~~~~~
    [ng] src/pages/group/group.ts:5:10 – error TS2305: Module ‘”C:/Users/Kenedy/Documents/ionic/projectname/node_modules/rxjs/Observable”‘ has no exported member ‘Observable’.
    [ng] 5 import { Observable } from ‘rxjs/Observable’;
    [ng] ~~~~~~~~~~
    [ng] src/pages/group/group.ts:26:6 – error TS2554: Expected 2 arguments, but got 1.
    [ng] 26 @ViewChild(‘GroupTabs’) groupTabs: Slides;
    [ng] ~~~~~~~~~~~~~~~~~~~~~~
    [ng] node_modules/@angular/core/core.d.ts:7888:47
    [ng] 7888 (selector: Type<any> | Function | string, opts: {
    [ng] ~~~~~~~
    [ng] 7889 read?: any;
    [ng] ~~~~~~~~~~~~~~~~~~~
    [ng] 7890 static: boolean;
    [ng] ~~~~~~~~~~~~~~~~~~~~~~~~
    [ng] 7891 }): any;
    [ng] ~~~~~
    [ng] An argument for ‘opts’ was not provided.
    [ng] src/pages/group/group.ts:26:40 – error TS2709: Cannot use namespace ‘Slides’ as a type.
    [ng] 26 @ViewChild(‘GroupTabs’) groupTabs: Slides;
    [ng] ~~~~~~
    [ng] src/pages/group/group.ts:27:6 – error TS2554: Expected 2 arguments, but got 1.
    [ng] 27 @ViewChild(‘GroupSlides’) groupSlides: Slides;
    [ng] ~~~~~~~~~~~~~~~~~~~~~~~~
    [ng] node_modules/@angular/core/core.d.ts:7888:47
    [ng] 7888 (selector: Type<any> | Function | string, opts: {
    [ng] ~~~~~~~
    [ng] 7889 read?: any;
    [ng] ~~~~~~~~~~~~~~~~~~~
    [ng] 7890 static: boolean;
    [ng] ~~~~~~~~~~~~~~~~~~~~~~~~
    [ng] 7891 }): any;
    [ng] ~~~~~
    [ng] An argument for ‘opts’ was not provided.
    [ng] src/pages/group/group.ts:27:44 – error TS2709: Cannot use namespace ‘Slides’ as a type.
    [ng] 27 @ViewChild(‘GroupSlides’) groupSlides: Slides;
    [ng] ~~~~~~
    [ng] src/pages/group/group.ts:28:32 – error TS2709: Cannot use namespace ‘NavController’ as a type.
    [ng] 28 constructor(public navCtrl: NavController,
    [ng] ~~~~~~~~~~~~~
    [ng] src/pages/group/group.ts:31:35 – error TS2709: Cannot use namespace ‘NavParams’ as a type.
    [ng] 31 public navParams: NavParams,
    [ng] ~~~~~~~~~
    [ng] src/pages/group/group.ts:32:30 – error TS2709: Cannot use namespace ‘NavController’ as a type.
    [ng] 32 private nav: NavController,
    [ng] ~~~~~~~~~~~~~
    [ng] src/pages/group/group.ts:34:35 – error TS2709: Cannot use namespace ‘ToastController’ as a type.
    [ng] 34 private toastCtrl:ToastController,
    [ng] ~~~~~~~~~~~~~~~
    [ng] src/pages/group/group.ts:35:37 – error TS2709: Cannot use namespace ‘LoadingController’ as a type.
    [ng] 35 public loadingCtrl: LoadingController
    [ng] ~~~~~~~~~~~~~~~~~
    [ng] src/pages/groupdirectory/groupdirectory.ts:5:10 – error TS2305: Module ‘”C:/Users/Kenedy/Documents/ionic/projectname/node_modules/rxjs/Observable”‘ has no exported member ‘Observable’.
    [ng] 5 import { Observable } from ‘rxjs/Observable’;
    [ng] ~~~~~~~~~~
    [ng] src/pages/groupdirectory/groupdirectory.ts:34:33 – error TS2709: Cannot use namespace ‘NavController’ as a type.
    [ng] 34 constructor(public navCtrl: NavController,
    [ng] ~~~~~~~~~~~~~
    [ng] src/pages/groupdirectory/groupdirectory.ts:37:35 – error TS2709: Cannot use namespace ‘NavParams’ as a type.
    [ng] 37 public navParams: NavParams,
    [ng] ~~~~~~~~~
    [ng] src/pages/groupdirectory/groupdirectory.ts:38:30 – error TS2709: Cannot use namespace ‘NavController’ as a type.
    [ng] 38 private nav: NavController,
    [ng] ~~~~~~~~~~~~~
    [ng] src/pages/groupdirectory/groupdirectory.ts:40:35 – error TS2709: Cannot use namespace ‘ToastController’ as a type.
    [ng] 40 private toastCtrl:ToastController,
    [ng] ~~~~~~~~~~~~~~~
    [ng] src/pages/groupdirectory/groupdirectory.ts:41:37 – error TS2709: Cannot use namespace ‘LoadingController’ as a type.
    [ng] 41 public loadingCtrl: LoadingController
    [ng] ~~~~~~~~~~~~~~~~~
    [ng] src/pages/home/home.ts:31:10 – error TS2305: Module ‘”C:/Users/Kenedy/Documents/ionic/projectname/node_modules/rxjs/Observable”‘ has no exported member ‘Observable’.
    [ng] 31 import { Observable } from ‘rxjs/Observable’;
    [ng] ~~~~~~~~~~
    [ng] src/pages/home/home.ts:52:30 – error TS2709: Cannot use namespace ‘NavController’ as a type.
    [ng] 52 constructor(public navCtrl: NavController,
    [ng] ~~~~~~~~~~~~~
    [ng] src/pages/home/home.ts:54:22 – error TS2709: Cannot use namespace ‘ModalController’ as a type.
    [ng] 54 private modalCtrl: ModalController,
    [ng] ~~~~~~~~~~~~~~~
    [ng] src/pages/home/home.ts:55:29 – error TS2709: Cannot use namespace ‘LoadingController’ as a type.
    [ng] 55 public loadingController: LoadingController,
    [ng] ~~~~~~~~~~~~~~~~~
    [ng] src/pages/home/home.ts:60:21 – error TS2709: Cannot use namespace ‘ToastController’ as a type.
    [ng] 60 private toastCtrl:ToastController
    [ng] ~~~~~~~~~~~~~~~
    [ng] src/pages/instructor/instructor.ts:30:3 – error TS2554: Expected 2 arguments, but got 1.
    [ng] 30 @ViewChild(‘InstructorTabs’) instructorTabs: Slides;
    [ng] ~~~~~~~~~~~~~~~~~~~~~~~~~~~
    [ng] node_modules/@angular/core/core.d.ts:7888:47
    [ng] 7888 (selector: Type<any> | Function | string, opts: {
    [ng] ~~~~~~~
    [ng] 7889 read?: any;
    [ng] ~~~~~~~~~~~~~~~~~~~
    [ng] 7890 static: boolean;
    [ng] ~~~~~~~~~~~~~~~~~~~~~~~~
    [ng] 7891 }): any;
    [ng] ~~~~~
    [ng] An argument for ‘opts’ was not provided.
    [ng] src/pages/instructor/instructor.ts:30:47 – error TS2709: Cannot use namespace ‘Slides’ as a type.
    [ng] 30 @ViewChild(‘InstructorTabs’) instructorTabs: Slides;
    [ng] ~~~~~~
    [ng] src/pages/instructor/instructor.ts:31:3 – error TS2554: Expected 2 arguments, but got 1.
    [ng] 31 @ViewChild(‘InstructorSlides’) instructorSlides: Slides;
    [ng] ~~~~~~~~~~~~~~~~~~~~~~~~~~~~~
    [ng] node_modules/@angular/core/core.d.ts:7888:47
    [ng] 7888 (selector: Type<any> | Function | string, opts: {
    [ng] ~~~~~~~
    [ng] 7889 read?: any;
    [ng] ~~~~~~~~~~~~~~~~~~~
    [ng] 7890 static: boolean;
    [ng] ~~~~~~~~~~~~~~~~~~~~~~~~
    [ng] 7891 }): any;
    [ng] ~~~~~
    [ng] An argument for ‘opts’ was not provided.
    [ng] src/pages/instructor/instructor.ts:31:51 – error TS2709: Cannot use namespace ‘Slides’ as a type.
    [ng] 31 @ViewChild(‘InstructorSlides’) instructorSlides: Slides;
    [ng] ~~~~~~
    [ng] src/pages/instructor/instructor.ts:33:19 – error TS2709: Cannot use namespace ‘NavController’ as a type.
    [ng] 33 public navCtrl: NavController,
    [ng] ~~~~~~~~~~~~~
    [ng] src/pages/instructor/instructor.ts:34:21 – error TS2709: Cannot use namespace ‘NavParams’ as a type.
    [ng] 34 public navParams: NavParams,
    [ng] ~~~~~~~~~
    [ng] src/pages/instructor/instructor.ts:35:21 – error TS2709: Cannot use namespace ‘ViewController’ as a type.
    [ng] 35 private viewCtrl: ViewController,
    [ng] ~~~~~~~~~~~~~~
    [ng] src/pages/instructors/instructors.ts:36:32 – error TS2709: Cannot use namespace ‘NavController’ as a type.
    [ng] 36 constructor(public navCtrl: NavController,
    [ng] ~~~~~~~~~~~~~
    [ng] src/pages/instructors/instructors.ts:37:23 – error TS2709: Cannot use namespace ‘NavParams’ as a type.
    [ng] 37 public navParams: NavParams,
    [ng] ~~~~~~~~~
    [ng] src/pages/instructors/instructors.ts:40:23 – error TS2709: Cannot use namespace ‘ModalController’ as a type.
    [ng] 40 private modalCtrl:ModalController,
    [ng] ~~~~~~~~~~~~~~~
    [ng] src/pages/instructors/instructors.ts:41:27 – error TS2709: Cannot use namespace ‘LoadingController’ as a type.
    [ng] 41 private loadingCtrl:LoadingController) {
    [ng] ~~~~~~~~~~~~~~~~~
    [ng] src/pages/intro/intro.ts:15:4 – error TS2554: Expected 2 arguments, but got 1.
    [ng] 15 @ViewChild(‘IntroTabs’) introTabs: Slides;
    [ng] ~~~~~~~~~~~~~~~~~~~~~~
    [ng] node_modules/@angular/core/core.d.ts:7888:47
    [ng] 7888 (selector: Type<any> | Function | string, opts: {
    [ng] ~~~~~~~
    [ng] 7889 read?: any;
    [ng] ~~~~~~~~~~~~~~~~~~~
    [ng] 7890 static: boolean;
    [ng] ~~~~~~~~~~~~~~~~~~~~~~~~
    [ng] 7891 }): any;
    [ng] ~~~~~
    [ng] An argument for ‘opts’ was not provided.
    [ng] src/pages/intro/intro.ts:15:38 – error TS2709: Cannot use namespace ‘Slides’ as a type.
    [ng] 15 @ViewChild(‘IntroTabs’) introTabs: Slides;
    [ng] ~~~~~~
    [ng] src/pages/intro/intro.ts:19:21 – error TS2709: Cannot use namespace ‘NavController’ as a type.
    [ng] 19 public navCtrl: NavController,
    [ng] ~~~~~~~~~~~~~
    [ng] src/pages/login/login.ts:52:6 – error TS2554: Expected 2 arguments, but got 1.
    [ng] 52 @ViewChild(Content) content: Content;
    [ng] ~~~~~~~~~~~~~~~~~~
    [ng] node_modules/@angular/core/core.d.ts:7888:47
    [ng] 7888 (selector: Type<any> | Function | string, opts: {
    [ng] ~~~~~~~
    [ng] 7889 read?: any;
    [ng] ~~~~~~~~~~~~~~~~~~~
    [ng] 7890 static: boolean;
    [ng] ~~~~~~~~~~~~~~~~~~~~~~~~
    [ng] 7891 }): any;
    [ng] ~~~~~
    [ng] An argument for ‘opts’ was not provided.
    [ng] src/pages/login/login.ts:52:34 – error TS2709: Cannot use namespace ‘Content’ as a type.
    [ng] 52 @ViewChild(Content) content: Content;
    [ng] ~~~~~~~
    [ng] src/pages/login/login.ts:54:33 – error TS2709: Cannot use namespace ‘NavController’ as a type.
    [ng] 54 constructor(private navCtrl: NavController,
    [ng] ~~~~~~~~~~~~~
    [ng] src/pages/login/login.ts:55:27 – error TS2709: Cannot use namespace ‘ViewController’ as a type.
    [ng] 55 private viewCtrl: ViewController,
    [ng] ~~~~~~~~~~~~~~
    [ng] src/pages/login/login.ts:56:28 – error TS2709: Cannot use namespace ‘ToastController’ as a type.
    [ng] 56 private toastCtrl: ToastController,
    [ng] ~~~~~~~~~~~~~~~
    [ng] src/pages/login/login.ts:57:29 – error TS2709: Cannot use namespace ‘NavParams’ as a type.
    [ng] 57 private navParams : NavParams,
    [ng] ~~~~~~~~~
    [ng] src/pages/login/login.ts:60:26 – error TS2709: Cannot use namespace ‘Platform’ as a type.
    [ng] 60 private platform:Platform,
    [ng] ~~~~~~~~
    [ng] src/pages/login/login.ts:64:29 – error TS2709: Cannot use namespace ‘LoadingController’ as a type.
    [ng] 64 private loadingCtrl:LoadingController,
    [ng] ~~~~~~~~~~~~~~~~~
    [ng] src/pages/login/login.ts:65:24 – error TS2709: Cannot use namespace ‘ActionSheetController’ as a type.
    [ng] 65 private action:ActionSheetController,
    [ng] ~~~~~~~~~~~~~~~~~~~~~
    [ng] src/pages/login/login.ts:66:27 – error TS2709: Cannot use namespace ‘AlertController’ as a type.
    [ng] 66 private alertCtrl:AlertController,
    [ng] ~~~~~~~~~~~~~~~
    [ng] src/pages/login/login.ts:67:25 – error TS2709: Cannot use namespace ‘Camera’ as a type.
    [ng] 67 private camera: Camera,
    [ng] ~~~~~~
    [ng] src/pages/login/login.ts:68:21 – error TS2709: Cannot use namespace ‘InAppBrowser’ as a type.
    [ng] 68 private iab:InAppBrowser,
    [ng] ~~~~~~~~~~~~
    [ng] src/pages/login/login.ts:69:25 – error TS2709: Cannot use namespace ‘App’ as a type.
    [ng] 69 public appCtrl: App
    [ng] ~~~
    [ng] src/pages/member/member.ts:20:33 – error TS2709: Cannot use namespace ‘NavController’ as a type.
    [ng] 20 constructor(public navCtrl: NavController,
    [ng] ~~~~~~~~~~~~~
    [ng] src/pages/member/member.ts:22:26 – error TS2709: Cannot use namespace ‘Platform’ as a type.
    [ng] 22 private platform:Platform,
    [ng] ~~~~~~~~
    [ng] src/pages/member/member.ts:24:27 – error TS2709: Cannot use namespace ‘NavParams’ as a type.
    [ng] 24 public navParams: NavParams,
    [ng] ~~~~~~~~~
    [ng] src/pages/member/member.ts:25:22 – error TS2709: Cannot use namespace ‘NavController’ as a type.
    [ng] 25 private nav: NavController,
    [ng] ~~~~~~~~~~~~~
    [ng] src/pages/member/member.ts:26:28 – error TS2709: Cannot use namespace ‘ToastController’ as a type.
    [ng] 26 private toastCtrl: ToastController,
    [ng] ~~~~~~~~~~~~~~~
    [ng] src/pages/member/member.ts:27:29 – error TS2709: Cannot use namespace ‘LoadingController’ as a type.
    [ng] 27 public loadingCtrl: LoadingController,
    [ng] ~~~~~~~~~~~~~~~~~
    [ng] src/pages/member/member.ts:28:21 – error TS2709: Cannot use namespace ‘InAppBrowser’ as a type.
    [ng] 28 private iab:InAppBrowser
    [ng] ~~~~~~~~~~~~
    [ng] src/pages/membersdirectory/membersdirectory.ts:5:10 – error TS2305: Module ‘”C:/Users/Kenedy/Documents/ionic/projectname/node_modules/rxjs/Observable”‘ has no exported member ‘Observable’.
    [ng] 5 import { Observable } from ‘rxjs/Observable’;
    [ng] ~~~~~~~~~~
    [ng] src/pages/membersdirectory/membersdirectory.ts:33:33 – error TS2709: Cannot use namespace ‘NavController’ as a type.
    [ng] 33 constructor(public navCtrl: NavController,
    [ng] ~~~~~~~~~~~~~
    [ng] src/pages/membersdirectory/membersdirectory.ts:36:35 – error TS2709: Cannot use namespace ‘NavParams’ as a type.
    [ng] 36 public navParams: NavParams,
    [ng] ~~~~~~~~~
    [ng] src/pages/membersdirectory/membersdirectory.ts:37:30 – error TS2709: Cannot use namespace ‘NavController’ as a type.
    [ng] 37 private nav: NavController,
    [ng] ~~~~~~~~~~~~~
    [ng] src/pages/membersdirectory/membersdirectory.ts:38:35 – error TS2709: Cannot use namespace ‘ToastController’ as a type.
    [ng] 38 private toastCtrl:ToastController,
    [ng] ~~~~~~~~~~~~~~~
    [ng] src/pages/membersdirectory/membersdirectory.ts:39:37 – error TS2709: Cannot use namespace ‘LoadingController’ as a type.
    [ng] 39 public loadingCtrl: LoadingController
    [ng] ~~~~~~~~~~~~~~~~~
    [ng] src/pages/message/message.ts:8:10 – error TS2305: Module ‘”C:/Users/Kenedy/Documents/ionic/projectname/node_modules/rxjs/Observable”‘ has no exported member ‘Observable’.
    [ng] 8 import { Observable } from ‘rxjs/Observable’;
    [ng] ~~~~~~~~~~
    [ng] src/pages/message/message.ts:44:6 – error TS2554: Expected 2 arguments, but got 1.
    [ng] 44 @ViewChild(‘MessageTabs’) messageTabs: Slides;
    [ng] ~~~~~~~~~~~~~~~~~~~~~~~~
    [ng] node_modules/@angular/core/core.d.ts:7888:47
    [ng] 7888 (selector: Type<any> | Function | string, opts: {
    [ng] ~~~~~~~
    [ng] 7889 read?: any;
    [ng] ~~~~~~~~~~~~~~~~~~~
    [ng] 7890 static: boolean;
    [ng] ~~~~~~~~~~~~~~~~~~~~~~~~
    [ng] 7891 }): any;
    [ng] ~~~~~
    [ng] An argument for ‘opts’ was not provided.
    [ng] src/pages/message/message.ts:44:44 – error TS2709: Cannot use namespace ‘Slides’ as a type.
    [ng] 44 @ViewChild(‘MessageTabs’) messageTabs: Slides;
    [ng] ~~~~~~
    [ng] src/pages/message/message.ts:45:6 – error TS2554: Expected 2 arguments, but got 1.
    [ng] 45 @ViewChild(‘MessageSlides’) messageSlides: Slides;
    [ng] ~~~~~~~~~~~~~~~~~~~~~~~~~~
    [ng] node_modules/@angular/core/core.d.ts:7888:47
    [ng] 7888 (selector: Type<any> | Function | string, opts: {
    [ng] ~~~~~~~
    [ng] 7889 read?: any;
    [ng] ~~~~~~~~~~~~~~~~~~~
    [ng] 7890 static: boolean;
    [ng] ~~~~~~~~~~~~~~~~~~~~~~~~
    [ng] 7891 }): any;
    [ng] ~~~~~
    [ng] An argument for ‘opts’ was not provided.
    [ng] src/pages/message/message.ts:45:48 – error TS2709: Cannot use namespace ‘Slides’ as a type.
    [ng] 45 @ViewChild(‘MessageSlides’) messageSlides: Slides;
    [ng] ~~~~~~
    [ng] src/pages/message/message.ts:51:23 – error TS2709: Cannot use namespace ‘ToastController’ as a type.
    [ng] 51 private toastCtrl:ToastController,
    [ng] ~~~~~~~~~~~~~~~
    [ng] src/pages/message/message.ts:53:25 – error TS2709: Cannot use namespace ‘NavController’ as a type.
    [ng] 53 public navCtrl: NavController,
    [ng] ~~~~~~~~~~~~~
    [ng] src/pages/message/message.ts:54:29 – error TS2709: Cannot use namespace ‘LoadingController’ as a type.
    [ng] 54 public loadingCtrl: LoadingController,
    [ng] ~~~~~~~~~~~~~~~~~
    [ng] src/pages/message/message.ts:55:27 – error TS2709: Cannot use namespace ‘NavParams’ as a type.
    [ng] 55 public navParams: NavParams
    [ng] ~~~~~~~~~
    [ng] src/pages/multiselector/multiselector.ts:25:25 – error TS2709: Cannot use namespace ‘NavController’ as a type.
    [ng] 25 public navCtrl: NavController,
    [ng] ~~~~~~~~~~~~~
    [ng] src/pages/post/post.ts:14:30 – error TS2709: Cannot use namespace ‘NavController’ as a type.
    [ng] 14 constructor(public navCtrl: NavController,
    [ng] ~~~~~~~~~~~~~
    [ng] src/pages/post/post.ts:15:21 – error TS2709: Cannot use namespace ‘NavParams’ as a type.
    [ng] 15 private navParams:NavParams,
    [ng] ~~~~~~~~~
    [ng] src/pages/post/post.ts:18:29 – error TS2709: Cannot use namespace ‘LoadingController’ as a type.
    [ng] 18 private loadingController:LoadingController) {
    [ng] ~~~~~~~~~~~~~~~~~
    [ng] src/pages/profile/profile.ts:87:6 – error TS2554: Expected 2 arguments, but got 1.
    [ng] 87 @ViewChild(‘ProfileTabs’) profileTabs: Slides;
    [ng] ~~~~~~~~~~~~~~~~~~~~~~~~
    [ng] node_modules/@angular/core/core.d.ts:7888:47
    [ng] 7888 (selector: Type<any> | Function | string, opts: {
    [ng] ~~~~~~~
    [ng] 7889 read?: any;
    [ng] ~~~~~~~~~~~~~~~~~~~
    [ng] 7890 static: boolean;
    [ng] ~~~~~~~~~~~~~~~~~~~~~~~~
    [ng] 7891 }): any;
    [ng] ~~~~~
    [ng] An argument for ‘opts’ was not provided.
    [ng] src/pages/profile/profile.ts:87:44 – error TS2709: Cannot use namespace ‘Slides’ as a type.
    [ng] 87 @ViewChild(‘ProfileTabs’) profileTabs: Slides;
    [ng] ~~~~~~
    [ng] src/pages/profile/profile.ts:88:6 – error TS2554: Expected 2 arguments, but got 1.
    [ng] 88 @ViewChild(‘ProfileSlides’) profileSlides: Slides;
    [ng] ~~~~~~~~~~~~~~~~~~~~~~~~~~
    [ng] node_modules/@angular/core/core.d.ts:7888:47
    [ng] 7888 (selector: Type<any> | Function | string, opts: {
    [ng] ~~~~~~~
    [ng] 7889 read?: any;
    [ng] ~~~~~~~~~~~~~~~~~~~
    [ng] 7890 static: boolean;
    [ng] ~~~~~~~~~~~~~~~~~~~~~~~~
    [ng] 7891 }): any;
    [ng] ~~~~~
    [ng] An argument for ‘opts’ was not provided.
    [ng] src/pages/profile/profile.ts:88:48 – error TS2709: Cannot use namespace ‘Slides’ as a type.
    [ng] 88 @ViewChild(‘ProfileSlides’) profileSlides: Slides;
    [ng] ~~~~~~
    [ng] src/pages/profile/profile.ts:89:6 – error TS2554: Expected 2 arguments, but got 1.
    [ng] 89 @ViewChild(Content) content: Content;
    [ng] ~~~~~~~~~~~~~~~~~~
    [ng] node_modules/@angular/core/core.d.ts:7888:47
    [ng] 7888 (selector: Type<any> | Function | string, opts: {
    [ng] ~~~~~~~
    [ng] 7889 read?: any;
    [ng] ~~~~~~~~~~~~~~~~~~~
    [ng] 7890 static: boolean;
    [ng] ~~~~~~~~~~~~~~~~~~~~~~~~
    [ng] 7891 }): any;
    [ng] ~~~~~
    [ng] An argument for ‘opts’ was not provided.
    [ng] src/pages/profile/profile.ts:89:34 – error TS2709: Cannot use namespace ‘Content’ as a type.
    [ng] 89 @ViewChild(Content) content: Content;
    [ng] ~~~~~~~
    [ng] src/pages/profile/profile.ts:90:6 – error TS2554: Expected 2 arguments, but got 1.
    [ng] 90 @ViewChild(‘barCanvas’) barCanvas;
    [ng] ~~~~~~~~~~~~~~~~~~~~~~
    [ng] node_modules/@angular/core/core.d.ts:7888:47
    [ng] 7888 (selector: Type<any> | Function | string, opts: {
    [ng] ~~~~~~~
    [ng] 7889 read?: any;
    [ng] ~~~~~~~~~~~~~~~~~~~
    [ng] 7890 static: boolean;
    [ng] ~~~~~~~~~~~~~~~~~~~~~~~~
    [ng] 7891 }): any;
    [ng] ~~~~~
    [ng] An argument for ‘opts’ was not provided.
    [ng] src/pages/profile/profile.ts:91:6 – error TS2554: Expected 2 arguments, but got 1.
    [ng] 91 @ViewChild(‘lineCanvas’) lineCanvas;
    [ng] ~~~~~~~~~~~~~~~~~~~~~~~
    [ng] node_modules/@angular/core/core.d.ts:7888:47
    [ng] 7888 (selector: Type<any> | Function | string, opts: {
    [ng] ~~~~~~~
    [ng] 7889 read?: any;
    [ng] ~~~~~~~~~~~~~~~~~~~
    [ng] 7890 static: boolean;
    [ng] ~~~~~~~~~~~~~~~~~~~~~~~~
    [ng] 7891 }): any;
    [ng] ~~~~~
    [ng] An argument for ‘opts’ was not provided.
    [ng] src/pages/profile/profile.ts:93:6 – error TS2554: Expected 2 arguments, but got 1.
    [ng] 93 @ViewChild(‘ChatTabs’) chatTabs: Slides;
    [ng] ~~~~~~~~~~~~~~~~~~~~~
    [ng] node_modules/@angular/core/core.d.ts:7888:47
    [ng] 7888 (selector: Type<any> | Function | string, opts: {
    [ng] ~~~~~~~
    [ng] 7889 read?: any;
    [ng] ~~~~~~~~~~~~~~~~~~~
    [ng] 7890 static: boolean;
    [ng] ~~~~~~~~~~~~~~~~~~~~~~~~
    [ng] 7891 }): any;
    [ng] ~~~~~
    [ng] An argument for ‘opts’ was not provided.
    [ng] src/pages/profile/profile.ts:93:38 – error TS2709: Cannot use namespace ‘Slides’ as a type.
    [ng] 93 @ViewChild(‘ChatTabs’) chatTabs: Slides;
    [ng] ~~~~~~
    [ng] src/pages/profile/profile.ts:94:6 – error TS2554: Expected 2 arguments, but got 1.
    [ng] 94 @ViewChild(‘ChatSlides’) chatSlides: Slides;
    [ng] ~~~~~~~~~~~~~~~~~~~~~~~
    [ng] node_modules/@angular/core/core.d.ts:7888:47
    [ng] 7888 (selector: Type<any> | Function | string, opts: {
    [ng] ~~~~~~~
    [ng] 7889 read?: any;
    [ng] ~~~~~~~~~~~~~~~~~~~
    [ng] 7890 static: boolean;
    [ng] ~~~~~~~~~~~~~~~~~~~~~~~~
    [ng] 7891 }): any;
    [ng] ~~~~~
    [ng] An argument for ‘opts’ was not provided.
    [ng] src/pages/profile/profile.ts:94:42 – error TS2709: Cannot use namespace ‘Slides’ as a type.
    [ng] 94 @ViewChild(‘ChatSlides’) chatSlides: Slides;
    [ng] ~~~~~~
    [ng] src/pages/profile/profile.ts:98:34 – error TS2709: Cannot use namespace ‘NavController’ as a type.
    [ng] 98 constructor(private navCtrl: NavController,
    [ng] ~~~~~~~~~~~~~
    [ng] src/pages/profile/profile.ts:99:27 – error TS2709: Cannot use namespace ‘ViewController’ as a type.
    [ng] 99 private viewCtrl: ViewController,
    [ng] ~~~~~~~~~~~~~~
    [ng] src/pages/profile/profile.ts:100:28 – error TS2709: Cannot use namespace ‘ToastController’ as a type.
    [ng] 100 private toastCtrl: ToastController,
    [ng] ~~~~~~~~~~~~~~~
    [ng] src/pages/profile/profile.ts:101:28 – error TS2709: Cannot use namespace ‘NavParams’ as a type.
    [ng] 101 private navParams: NavParams,
    [ng] ~~~~~~~~~
    [ng] src/pages/profile/profile.ts:104:27 – error TS2709: Cannot use namespace ‘Platform’ as a type.
    [ng] 104 private platform: Platform,
    [ng] i 「wdm」: Failed to compile.
    [ng] ~~~~~~~~
    [ng] src/pages/profile/profile.ts:108:30 – error TS2709: Cannot use namespace ‘LoadingController’ as a type.
    [ng] 108 private loadingCtrl: LoadingController,
    [ng] ~~~~~~~~~~~~~~~~~
    [ng] src/pages/profile/profile.ts:109:25 – error TS2709: Cannot use namespace ‘ActionSheetController’ as a type.
    [ng] 109 private action: ActionSheetController,
    [ng] ~~~~~~~~~~~~~~~~~~~~~
    [ng] src/pages/profile/profile.ts:110:28 – error TS2709: Cannot use namespace ‘AlertController’ as a type.
    [ng] 110 private alertCtrl: AlertController,
    [ng] ~~~~~~~~~~~~~~~
    [ng] src/pages/profile/profile.ts:111:25 – error TS2709: Cannot use namespace ‘Camera’ as a type.
    [ng] 111 private camera: Camera,
    [ng] ~~~~~~
    [ng] src/pages/profile/profile.ts:112:22 – error TS2709: Cannot use namespace ‘InAppBrowser’ as a type.
    [ng] 112 private iab: InAppBrowser,
    [ng] ~~~~~~~~~~~~
    [ng] src/pages/profile/profile.ts:116:33 – error TS2709: Cannot use namespace ‘BarcodeScanner’ as a type.
    [ng] 116 private barcodeScanner: BarcodeScanner,
    [ng] ~~~~~~~~~~~~~~
    [ng] src/pages/profile/profile.ts:828:40 – error TS2709: Cannot use namespace ‘CameraOptions’ as a type.
    [ng] 828 const options: CameraOptions = {
    [ng] ~~~~~~~~~~~~~
    [ng] src/pages/profile/profile.ts:855:40 – error TS2709: Cannot use namespace ‘CameraOptions’ as a type.
    [ng] 855 const options: CameraOptions = {
    [ng] ~~~~~~~~~~~~~
    [ng] src/pages/register/register.ts:51:6 – error TS2554: Expected 2 arguments, but got 1.
    [ng] 51 @ViewChild(Content) content: Content;
    [ng] ~~~~~~~~~~~~~~~~~~
    [ng] node_modules/@angular/core/core.d.ts:7888:47
    [ng] 7888 (selector: Type<any> | Function | string, opts: {
    [ng] ~~~~~~~
    [ng] 7889 read?: any;
    [ng] ~~~~~~~~~~~~~~~~~~~
    [ng] 7890 static: boolean;
    [ng] ~~~~~~~~~~~~~~~~~~~~~~~~
    [ng] 7891 }): any;
    [ng] ~~~~~
    [ng] An argument for ‘opts’ was not provided.
    [ng] src/pages/register/register.ts:51:34 – error TS2709: Cannot use namespace ‘Content’ as a type.
    [ng] 51 @ViewChild(Content) content: Content;
    [ng] ~~~~~~~
    [ng] src/pages/register/register.ts:53:33 – error TS2709: Cannot use namespace ‘NavController’ as a type.
    [ng] 53 constructor(private navCtrl: NavController,
    [ng] ~~~~~~~~~~~~~
    [ng] src/pages/register/register.ts:54:27 – error TS2709: Cannot use namespace ‘ViewController’ as a type.
    [ng] 54 private viewCtrl: ViewController,
    [ng] ~~~~~~~~~~~~~~
    [ng] src/pages/register/register.ts:55:28 – error TS2709: Cannot use namespace ‘ToastController’ as a type.
    [ng] 55 private toastCtrl: ToastController,
    [ng] ~~~~~~~~~~~~~~~
    [ng] src/pages/register/register.ts:56:29 – error TS2709: Cannot use namespace ‘NavParams’ as a type.
    [ng] 56 private navParams : NavParams,
    [ng] ~~~~~~~~~
    [ng] src/pages/register/register.ts:59:26 – error TS2709: Cannot use namespace ‘Platform’ as a type.
    [ng] 59 private platform:Platform,
    [ng] ~~~~~~~~
    [ng] src/pages/register/register.ts:63:29 – error TS2709: Cannot use namespace ‘LoadingController’ as a type.
    [ng] 63 private loadingCtrl:LoadingController,
    [ng] ~~~~~~~~~~~~~~~~~
    [ng] src/pages/register/register.ts:64:24 – error TS2709: Cannot use namespace ‘ActionSheetController’ as a type.
    [ng] 64 private action:ActionSheetController,
    [ng] ~~~~~~~~~~~~~~~~~~~~~
    [ng] src/pages/register/register.ts:65:27 – error TS2709: Cannot use namespace ‘AlertController’ as a type.
    [ng] 65 private alertCtrl:AlertController,
    [ng] ~~~~~~~~~~~~~~~
    [ng] src/pages/register/register.ts:66:25 – error TS2709: Cannot use namespace ‘Camera’ as a type.
    [ng] 66 private camera: Camera,
    [ng] ~~~~~~
    [ng] src/pages/register/register.ts:67:21 – error TS2709: Cannot use namespace ‘InAppBrowser’ as a type.
    [ng] 67 private iab:InAppBrowser
    [ng] ~~~~~~~~~~~~
    [ng] src/pages/replydirectory/replydirectory.ts:5:10 – error TS2305: Module ‘”C:/Users/Kenedy/Documents/ionic/projectname/node_modules/rxjs/Observable”‘ has no exported member ‘Observable’.
    [ng] 5 import { Observable } from ‘rxjs/Observable’;
    [ng] ~~~~~~~~~~
    [ng] src/pages/replydirectory/replydirectory.ts:49:33 – error TS2709: Cannot use namespace ‘NavController’ as a type.
    [ng] 49 constructor(public navCtrl: NavController,
    [ng] ~~~~~~~~~~~~~
    [ng] src/pages/replydirectory/replydirectory.ts:52:27 – error TS2709: Cannot use namespace ‘NavParams’ as a type.
    [ng] 52 public navParams: NavParams,
    [ng] ~~~~~~~~~
    [ng] src/pages/replydirectory/replydirectory.ts:53:22 – error TS2709: Cannot use namespace ‘NavController’ as a type.
    [ng] 53 private nav: NavController,
    [ng] ~~~~~~~~~~~~~
    [ng] src/pages/replydirectory/replydirectory.ts:54:28 – error TS2709: Cannot use namespace ‘ToastController’ as a type.
    [ng] 54 private toastCtrl: ToastController,
    [ng] ~~~~~~~~~~~~~~~
    [ng] src/pages/replydirectory/replydirectory.ts:55:29 – error TS2709: Cannot use namespace ‘LoadingController’ as a type.
    [ng] 55 public loadingCtrl: LoadingController,
    [ng] ~~~~~~~~~~~~~~~~~
    [ng] src/pages/replydirectory/replydirectory.ts:56:28 – error TS2709: Cannot use namespace ‘AlertController’ as a type.
    [ng] 56 private alertCtrl: AlertController,
    [ng] ~~~~~~~~~~~~~~~
    [ng] src/pages/result/result.ts:20:21 – error TS2709: Cannot use namespace ‘NavController’ as a type.
    [ng] 20 public navCtrl: NavController,
    [ng] ~~~~~~~~~~~~~
    [ng] src/pages/result/result.ts:21:23 – error TS2709: Cannot use namespace ‘NavParams’ as a type.
    [ng] 21 public navParams: NavParams,
    [ng] ~~~~~~~~~
    [ng] src/pages/result/result.ts:24:27 – error TS2709: Cannot use namespace ‘LoadingController’ as a type.
    [ng] 24 private loadingCtrl:LoadingController,
    [ng] ~~~~~~~~~~~~~~~~~
    [ng] src/pages/reviewcourse/reviewcourse.ts:24:25 – error TS2709: Cannot use namespace ‘ViewController’ as a type.
    [ng] 24 private viewCtrl: ViewController,
    [ng] ~~~~~~~~~~~~~~
    [ng] src/pages/reviewcourse/reviewcourse.ts:25:24 – error TS2709: Cannot use namespace ‘NavController’ as a type.
    [ng] 25 private navCtrl: NavController,
    [ng] ~~~~~~~~~~~~~
    [ng] src/pages/reviewcourse/reviewcourse.ts:26:26 – error TS2709: Cannot use namespace ‘NavParams’ as a type.
    [ng] 26 private navParams: NavParams,
    [ng] ~~~~~~~~~
    [ng] src/pages/reviewcourse/reviewcourse.ts:29:27 – error TS2709: Cannot use namespace ‘LoadingController’ as a type.
    [ng] 29 private loadingCtrl:LoadingController){
    [ng] ~~~~~~~~~~~~~~~~~
    [ng] src/pages/search/search.ts:35:25 – error TS2709: Cannot use namespace ‘ViewController’ as a type.
    [ng] 35 private viewCtrl: ViewController,
    [ng] ~~~~~~~~~~~~~~
    [ng] src/pages/search/search.ts:36:23 – error TS2709: Cannot use namespace ‘NavController’ as a type.
    [ng] 36 public navCtrl: NavController,
    [ng] ~~~~~~~~~~~~~
    [ng] src/pages/search/search.ts:49:39 – error TS2339: Property ‘debounceTime’ does not exist on type ‘Observable<any>’.
    [ng] 49 this.searchControl.valueChanges.debounceTime(700).subscribe(search => {
    [ng] ~~~~~~~~~~~~
    [ng] src/pages/tabs/tabs.ts:42:18 – error TS2709: Cannot use namespace ‘NavController’ as a type.
    [ng] 42 private nav: NavController,
    [ng] ~~~~~~~~~~~~~
    [ng] src/pages/tabs/tabs.ts:43:24 – error TS2709: Cannot use namespace ‘NavParams’ as a type.
    [ng] 43 private navParams: NavParams,
    [ng] ~~~~~~~~~
    [ng] src/pages/tabs/tabs.ts:45:17 – error TS2709: Cannot use namespace ‘App’ as a type.
    [ng] 45 private app:App,
    [ng] ~~~
    [ng] src/pages/topicdirectory/topicdirectory.ts:5:10 – error TS2305: Module ‘”C:/Users/Kenedy/Documents/ionic/projectname/node_modules/rxjs/Observable”‘ has no exported member ‘Observable’.
    [ng] 5 import { Observable } from ‘rxjs/Observable’;
    [ng] ~~~~~~~~~~
    [ng] src/pages/topicdirectory/topicdirectory.ts:41:33 – error TS2709: Cannot use namespace ‘NavController’ as a type.
    [ng] 41 constructor(public navCtrl: NavController,
    [ng] ~~~~~~~~~~~~~
    [ng] src/pages/topicdirectory/topicdirectory.ts:44:27 – error TS2709: Cannot use namespace ‘NavParams’ as a type.
    [ng] 44 public navParams: NavParams,
    [ng] ~~~~~~~~~
    [ng] src/pages/topicdirectory/topicdirectory.ts:45:22 – error TS2709: Cannot use namespace ‘NavController’ as a type.
    [ng] 45 private nav: NavController,
    [ng] ~~~~~~~~~~~~~
    [ng] src/pages/topicdirectory/topicdirectory.ts:46:28 – error TS2709: Cannot use namespace ‘ToastController’ as a type.
    [ng] 46 private toastCtrl: ToastController,
    [ng] ~~~~~~~~~~~~~~~
    [ng] src/pages/topicdirectory/topicdirectory.ts:47:29 – error TS2709: Cannot use namespace ‘LoadingController’ as a type.
    [ng] 47 public loadingCtrl: LoadingController,
    [ng] ~~~~~~~~~~~~~~~~~
    [ng] src/pages/topicdirectory/topicdirectory.ts:48:28 – error TS2709: Cannot use namespace ‘AlertController’ as a type.
    [ng] 48 private alertCtrl: AlertController,
    [ng] ~~~~~~~~~~~~~~~
    [ng] src/pages/unitcomment/unitcomment.ts:8:10 – error TS2305: Module ‘”C:/Users/Kenedy/Documents/ionic/projectname/node_modules/rxjs/Observable”‘ has no exported member ‘Observable’.
    [ng] 8 import { Observable } from ‘rxjs/Observable’;
    [ng] ~~~~~~~~~~
    [ng] src/pages/unitcomment/unitcomment.ts:27:31 – error TS2709: Cannot use namespace ‘NavController’ as a type.
    [ng] 27 constructor(public navCtrl: NavController,
    [ng] ~~~~~~~~~~~~~
    [ng] src/pages/unitcomment/unitcomment.ts:28:24 – error TS2709: Cannot use namespace ‘NavParams’ as a type.
    [ng] 28 public navParams: NavParams,
    [ng] ~~~~~~~~~
    [ng] src/pages/unitcomment/unitcomment.ts:31:29 – error TS2709: Cannot use namespace ‘AlertController’ as a type.
    [ng] 31 public alertCtrl:AlertController,
    [ng] ~~~~~~~~~~~~~~~
    [ng] src/pages/unitcomment/unitcomment.ts:32:32 – error TS2709: Cannot use namespace ‘LoadingController’ as a type.
    [ng] 32 private loadingCtrl:LoadingController,
    [ng] ~~~~~~~~~~~~~~~~~
    [ng] src/pages/updates/updates.ts:16:22 – error TS2709: Cannot use namespace ‘ViewController’ as a type.
    [ng] 16 private viewCtrl:ViewController,
    [ng] ~~~~~~~~~~~~~~
    [ng] src/pages/uploadassignment/uploadassignment.ts:13:10 – error TS2305: Module ‘”C:/Users/Kenedy/Documents/ionic/projectname/node_modules/rxjs/Observable”‘ has no exported member ‘Observable’.
    [ng] 13 import { Observable } from ‘rxjs/Observable’;
    [ng] ~~~~~~~~~~
    [ng] src/pages/uploadassignment/uploadassignment.ts:49:24 – error TS2709: Cannot use namespace ‘NavController’ as a type.
    [ng] 49 public navCtrl: NavController,
    [ng] ~~~~~~~~~~~~~
    [ng] src/pages/uploadassignment/uploadassignment.ts:50:26 – error TS2709: Cannot use namespace ‘NavParams’ as a type.
    [ng] 50 public navParams: NavParams,
    [ng] ~~~~~~~~~
    [ng] src/pages/uploadassignment/uploadassignment.ts:53:31 – error TS2709: Cannot use namespace ‘AlertController’ as a type.
    [ng] 53 public alertCtrl:AlertController,
    [ng] ~~~~~~~~~~~~~~~
    [ng] src/pages/uploadassignment/uploadassignment.ts:54:40 – error TS2709: Cannot use namespace ‘LoadingController’ as a type.
    [ng] 54 private loadingController:LoadingController,
    [ng] ~~~~~~~~~~~~~~~~~
    [ng] src/pages/uploadassignment/uploadassignment.ts:56:26 – error TS2709: Cannot use namespace ‘Camera’ as a type.
    [ng] 56 private camera: Camera,
    [ng] ~~~~~~
    [ng] src/pages/uploadassignment/uploadassignment.ts:58:29 – error TS2709: Cannot use namespace ‘ActionSheetController’ as a type.
    [ng] 58 private action:ActionSheetController,
    [ng] ~~~~~~~~~~~~~~~~~~~~~
    [ng] src/pages/uploadassignment/uploadassignment.ts:59:32 – error TS2709: Cannot use namespace ‘FileTransfer’ as a type.
    [ng] 59 private transfer: FileTransfer,
    [ng] ~~~~~~~~~~~~
    [ng] src/pages/uploadassignment/uploadassignment.ts:60:33 – error TS2709: Cannot use namespace ‘ToastController’ as a type.
    [ng] 60 private toastCtrl: ToastController,
    [ng] ~~~~~~~~~~~~~~~
    [ng] src/pages/wallet/wallet.ts:12:10 – error TS2305: Module ‘”C:/Users/Kenedy/Documents/ionic/projectname/node_modules/rxjs/Observable”‘ has no exported member ‘Observable’.
    [ng] 12 import { Observable } from ‘rxjs/Observable’;
    [ng] ~~~~~~~~~~
    [ng] src/pages/wallet/wallet.ts:33:5 – error TS2554: Expected 2 arguments, but got 1.
    [ng] 33 @ViewChild(‘WalletTabs’) walletTabs: Slides;
    [ng] ~~~~~~~~~~~~~~~~~~~~~~~
    [ng] node_modules/@angular/core/core.d.ts:7888:47
    [ng] 7888 (selector: Type<any> | Function | string, opts: {
    [ng] ~~~~~~~
    [ng] 7889 read?: any;
    [ng] ~~~~~~~~~~~~~~~~~~~
    [ng] 7890 static: boolean;
    [ng] ~~~~~~~~~~~~~~~~~~~~~~~~
    [ng] 7891 }): any;
    [ng] ~~~~~
    [ng] An argument for ‘opts’ was not provided.
    [ng] src/pages/wallet/wallet.ts:33:41 – error TS2709: Cannot use namespace ‘Slides’ as a type.
    [ng] 33 @ViewChild(‘WalletTabs’) walletTabs: Slides;
    [ng] ~~~~~~
    [ng] src/pages/wallet/wallet.ts:34:5 – error TS2554: Expected 2 arguments, but got 1.
    [ng] 34 @ViewChild(‘WalletSlides’) walletSlides: Slides;
    [ng] ~~~~~~~~~~~~~~~~~~~~~~~~~
    [ng] node_modules/@angular/core/core.d.ts:7888:47
    [ng] 7888 (selector: Type<any> | Function | string, opts: {
    [ng] ~~~~~~~
    [ng] 7889 read?: any;
    [ng] ~~~~~~~~~~~~~~~~~~~
    [ng] 7890 static: boolean;
    [ng] ~~~~~~~~~~~~~~~~~~~~~~~~
    [ng] 7891 }): any;
    [ng] ~~~~~
    [ng] An argument for ‘opts’ was not provided.
    [ng] src/pages/wallet/wallet.ts:34:45 – error TS2709: Cannot use namespace ‘Slides’ as a type.
    [ng] 34 @ViewChild(‘WalletSlides’) walletSlides: Slides;
    [ng] ~~~~~~
    [ng] src/pages/wallet/wallet.ts:39:18 – error TS2709: Cannot use namespace ‘ToastController’ as a type.
    [ng] 39 private toast:ToastController,
    [ng] ~~~~~~~~~~~~~~~
    [ng] src/pages/wallet/wallet.ts:40:16 – error TS2709: Cannot use namespace ‘NavController’ as a type.
    [ng] 40 private nav:NavController,
    [ng] ~~~~~~~~~~~~~
    [ng] src/services/activity.ts:6:10 – error TS2305: Module ‘”C:/Users/Kenedy/Documents/ionic/projectname/node_modules/rxjs/Observable”‘ has no exported member ‘Observable’.
    [ng] 6 import { Observable } from ‘rxjs/Observable’;
    [ng] ~~~~~~~~~~
    [ng] src/services/activity.ts:31:19 – error TS2709: Cannot use namespace ‘Http’ as a type.
    [ng] 31 private http:Http,
    [ng] ~~~~
    [ng] src/services/activity.ts:32:25 – error TS2709: Cannot use namespace ‘Platform’ as a type.
    [ng] 32 private platform : Platform,
    [ng] ~~~~~~~~
    [ng] src/services/admob.ts:19:21 – error TS2709: Cannot use namespace ‘ToastController’ as a type.
    [ng] 19 private toastCtrl:ToastController,
    [ng] ~~~~~~~~~~~~~~~
    [ng] src/services/admob.ts:20:21 – error TS2709: Cannot use namespace ‘Platform’ as a type.
    [ng] 20 private platform: Platform,
    [ng] ~~~~~~~~
    [ng] src/services/attendance.ts:5:10 – error TS2305: Module ‘”C:/Users/Kenedy/Documents/ionic/projectname/node_modules/rxjs/Observable”‘ has no exported member ‘Observable’.
    [ng] 5 import { Observable } from ‘rxjs/Observable’;
    [ng] ~~~~~~~~~~
    [ng] src/services/attendance.ts:20:30 – error TS2709: Cannot use namespace ‘Http’ as a type.
    [ng] 20 constructor(private http:Http,
    [ng] ~~~~
    [ng] src/services/authentication.ts:7:10 – error TS2305: Module ‘”C:/Users/Kenedy/Documents/ionic/projectname/node_modules/rxjs/Observable”‘ has no exported member ‘Observable’.
    [ng] 7 import { Observable } from ‘rxjs/Observable’;
    [ng] ~~~~~~~~~~
    [ng] src/services/authentication.ts:49:22 – error TS2709: Cannot use namespace ‘Http’ as a type.
    [ng] 49 public http: Http,
    [ng] ~~~~
    [ng] src/services/authentication.ts:50:27 – error TS2709: Cannot use namespace ‘Platform’ as a type.
    [ng] 50 private platform: Platform,
    [ng] ~~~~~~~~
    [ng] src/services/authentication.ts:53:20 – error TS2709: Cannot use namespace ‘Facebook’ as a type.
    [ng] 53 public fb: Facebook,
    [ng] ~~~~~~~~
    [ng] src/services/authentication.ts:54:29 – error TS2709: Cannot use namespace ‘LoadingController’ as a type.
    [ng] 54 public loadingCtrl: LoadingController,
    [ng] ~~~~~~~~~~~~~~~~~
    [ng] src/services/authentication.ts:55:27 – error TS2709: Cannot use namespace ‘ToastController’ as a type.
    [ng] 55 public toastCtrl: ToastController,
    [ng] ~~~~~~~~~~~~~~~
    [ng] src/services/authentication.ts:56:22 – error TS2709: Cannot use namespace ‘InAppBrowser’ as a type.
    [ng] 56 private iab: InAppBrowser,
    [ng] ~~~~~~~~~~~~
    [ng] src/services/authentication.ts:57:29 – error TS2709: Cannot use namespace ‘GooglePlus’ as a type.
    [ng] 57 private googlePlus: GooglePlus,
    [ng] ~~~~~~~~~~
    [ng] src/services/authentication.ts:58:25 – error TS2709: Cannot use namespace ‘Device’ as a type.
    [ng] 58 private device: Device,
    [ng] ~~~~~~
    [ng] src/services/blog.ts:7:10 – error TS2305: Module ‘”C:/Users/Kenedy/Documents/ionic/projectname/node_modules/rxjs/Observable”‘ has no exported member ‘Observable’.
    [ng] 7 import { Observable } from ‘rxjs/Observable’;
    [ng] ~~~~~~~~~~
    [ng] src/services/blog.ts:22:18 – error TS2709: Cannot use namespace ‘Http’ as a type.
    [ng] 22 public http:Http,
    [ng] ~~~~
    [ng] src/services/chat.ts:8:10 – error TS2305: Module ‘”C:/Users/Kenedy/Documents/ionic/projectname/node_modules/rxjs/Observable”‘ has no exported member ‘Observable’.
    [ng] 8 import { Observable } from ‘rxjs/Observable’;
    [ng] ~~~~~~~~~~
    [ng] src/services/chat.ts:30:17 – error TS2709: Cannot use namespace ‘Http’ as a type.
    [ng] 30 private http: Http,
    [ng] ~~~~
    [ng] src/services/config.ts:54:17 – error TS2709: Cannot use namespace ‘Http’ as a type.
    [ng] 54 private http: Http
    [ng] ~~~~
    [ng] src/services/course.ts:5:10 – error TS2305: Module ‘”C:/Users/Kenedy/Documents/ionic/projectname/node_modules/rxjs/Observable”‘ has no exported member ‘Observable’.
    [ng] 5 import { Observable } from ‘rxjs/Observable’;
    [ng] ~~~~~~~~~~
    [ng] src/services/course.ts:47:30 – error TS2709: Cannot use namespace ‘Http’ as a type.
    [ng] 47 constructor(private http:Http,
    [ng] ~~~~
    [ng] src/services/course.ts:66:29 – error TS2339: Property ‘length’ does not exist on type ‘Promise<any>’.
    [ng] 66 for(let i=0;i<body.length;i++){
    [ng] ~~~~~~
    [ng] src/services/course.ts:76:46 – error TS2339: Property ‘error’ does not exist on type ‘Promise<any>’.
    [ng] 76 return Observable.throw(error.json().error || “500 internal server error”);
    [ng] ~~~~~
    [ng] src/services/coursecategories.ts:4:10 – error TS2305: Module ‘”C:/Users/Kenedy/Documents/ionic/projectname/node_modules/rxjs/Observable”‘ has no exported member ‘Observable’.
    [ng] 4 import { Observable } from ‘rxjs/Observable’;
    [ng] ~~~~~~~~~~
    [ng] src/services/coursecategories.ts:23:22 – error TS2709: Cannot use namespace ‘Http’ as a type.
    [ng] 23 private http:Http,
    [ng] ~~~~
    [ng] src/services/forum.ts:9:10 – error TS2305: Module ‘”C:/Users/Kenedy/Documents/ionic/projectname/node_modules/rxjs/Observable”‘ has no exported member ‘Observable’.
    [ng] 9 import { Observable } from ‘rxjs/Observable’;
    [ng] ~~~~~~~~~~
    [ng] src/services/forum.ts:25:17 – error TS2709: Cannot use namespace ‘Http’ as a type.
    [ng] 25 private http: Http,
    [ng] ~~~~
    [ng] src/services/group.ts:9:10 – error TS2305: Module ‘”C:/Users/Kenedy/Documents/ionic/projectname/node_modules/rxjs/Observable”‘ has no exported member ‘Observable’.
    [ng] 9 import { Observable } from ‘rxjs/Observable’;
    [ng] ~~~~~~~~~~
    [ng] src/services/group.ts:22:16 – error TS2709: Cannot use namespace ‘Http’ as a type.
    [ng] 22 private http:Http,
    [ng] ~~~~
    [ng] src/services/imageCache.ts:7:10 – error TS2305: Module ‘”C:/Users/Kenedy/Documents/ionic/projectname/node_modules/rxjs/ReplaySubject”‘ has no exported member ‘ReplaySubject’.
    [ng] 7 import { ReplaySubject } from ‘rxjs/ReplaySubject’;
    [ng] ~~~~~~~~~~~~~
    [ng] src/services/imageCache.ts:9:10 – error TS2305: Module ‘”C:/Users/Kenedy/Documents/ionic/projectname/node_modules/rxjs/Observable”‘ has no exported member ‘Observable’.
    [ng] 9 import { Observable } from ‘rxjs/Observable’;
    [ng] ~~~~~~~~~~
    [ng] src/services/imageCache.ts:10:10 – error TS2305: Module ‘”C:/Users/Kenedy/Documents/ionic/projectname/node_modules/rxjs/observable/bindCallback”‘ has no exported member ‘bindCallback’.
    [ng] 10 import { bindCallback } from ‘rxjs/observable/bindCallback’;
    [ng] ~~~~~~~~~~~~
    [ng] src/services/imageCache.ts:21:33 – error TS2709: Cannot use namespace ‘Platform’ as a type.
    [ng] 21 constructor(private platform: Platform, private file: File) {
    [ng] ~~~~~~~~
    [ng] src/services/imageCache.ts:76:46 – error TS2339: Property ‘applicationStorageDirectory’ does not exist on type ‘File’.
    [ng] 76 const urlIos = ${normalizeURL(this.file.applicationStorageDirectory)}Library/files/${normalizeURL(url)};
    [ng] ~~~~~~~~~~~~~~~~~~~~~~~~~~~
    [ng] src/services/members.ts:7:10 – error TS2305: Module ‘”C:/Users/Kenedy/Documents/ionic/projectname/node_modules/rxjs/Observable”‘ has no exported member ‘Observable’.
    [ng] 7 import { Observable } from ‘rxjs/Observable’;
    [ng] ~~~~~~~~~~
    [ng] src/services/members.ts:23:23 – error TS2709: Cannot use namespace ‘Http’ as a type.
    [ng] 23 private http: Http,
    [ng] ~~~~
    [ng] src/services/members.ts:25:28 – error TS2709: Cannot use namespace ‘ToastController’ as a type.
    [ng] 25 private toastCtrl: ToastController,
    [ng] ~~~~~~~~~~~~~~~
    [ng] src/services/members.ts:28:30 – error TS2709: Cannot use namespace ‘LoadingController’ as a type.
    [ng] 28 private loadingCtrl: LoadingController,
    [ng] ~~~~~~~~~~~~~~~~~
    [ng] src/services/notes_discussions.ts:7:10 – error TS2305: Module ‘”C:/Users/Kenedy/Documents/ionic/projectname/node_modules/rxjs/Observable”‘ has no exported member ‘Observable’.
    [ng] 7 import { Observable } from ‘rxjs/Observable’;
    [ng] ~~~~~~~~~~
    [ng] src/services/notes_discussions.ts:33:20 – error TS2709: Cannot use namespace ‘Http’ as a type.
    [ng] 33 private http:Http,
    [ng] ~~~~
    [ng] src/services/notes_discussions.ts:34:26 – error TS2709: Cannot use namespace ‘Platform’ as a type.
    [ng] 34 private platform : Platform,
    [ng] ~~~~~~~~
    [ng] src/services/notes_discussions.ts:36:28 – error TS2709: Cannot use namespace ‘ToastController’ as a type.
    [ng] 36 private toastCtrl: ToastController,
    [ng] ~~~~~~~~~~~~~~~
    [ng] src/services/push_notification.ts:9:10 – error TS2305: Module ‘”C:/Users/Kenedy/Documents/ionic/projectname/node_modules/rxjs/Observable”‘ has no exported member ‘Observable’.
    [ng] 9 import { Observable } from ‘rxjs/Observable’;
    [ng] ~~~~~~~~~~
    [ng] src/services/push_notification.ts:18:17 – error TS2709: Cannot use namespace ‘Http’ as a type.
    [ng] 18 private http: Http,
    [ng] ~~~~
    [ng] src/services/push_notification.ts:21:17 – error TS2709: Cannot use namespace ‘Push’ as a type.
    [ng] 21 private push: Push,
    [ng] ~~~~
    [ng] src/services/push_notification.ts:22:21 – error TS2709: Cannot use namespace ‘Platform’ as a type.
    [ng] 22 private platform: Platform,
    [ng] ~~~~~~~~
    [ng] src/services/push_notification.ts:23:22 – error TS2709: Cannot use namespace ‘ToastController’ as a type.
    [ng] 23 private toastCtrl: ToastController,
    [ng] ~~~~~~~~~~~~~~~
    [ng] src/services/push_notification.ts:39:19 – error TS2709: Cannot use namespace ‘PushOptions’ as a type.
    [ng] 39 const options: PushOptions = {
    [ng] ~~~~~~~~~~~
    [ng] src/services/push_notification.ts:49:22 – error TS2709: Cannot use namespace ‘PushObject’ as a type.
    [ng] 49 const pushObject: PushObject = this.push.init(options);
    [ng] ~~~~~~~~~~
    [ng] src/services/quiz.ts:4:10 – error TS2305: Module ‘”C:/Users/Kenedy/Documents/ionic/projectname/node_modules/rxjs/Observable”‘ has no exported member ‘Observable’.
    [ng] 4 import { Observable } from ‘rxjs/Observable’;
    [ng] ~~~~~~~~~~
    [ng] src/services/quiz.ts:25:30 – error TS2709: Cannot use namespace ‘Http’ as a type.
    [ng] 25 constructor(private http:Http,
    [ng] ~~~~
    [ng] src/services/status.ts:5:10 – error TS2305: Module ‘”C:/Users/Kenedy/Documents/ionic/projectname/node_modules/rxjs/Observable”‘ has no exported member ‘Observable’.
    [ng] 5 import { Observable } from ‘rxjs/Observable’;
    [ng] ~~~~~~~~~~
    [ng] src/services/status.ts:34:30 – error TS2709: Cannot use namespace ‘Http’ as a type.
    [ng] 34 constructor(private http:Http,
    [ng] ~~~~
    [ng] src/services/upload_assignment.ts:7:10 – error TS2305: Module ‘”C:/Users/Kenedy/Documents/ionic/projectname/node_modules/rxjs/Observable”‘ has no exported member ‘Observable’.
    [ng] 7 import { Observable } from ‘rxjs/Observable’;
    [ng] ~~~~~~~~~~
    [ng] src/services/upload_assignment.ts:29:26 – error TS2709: Cannot use namespace ‘Http’ as a type.
    [ng] 29 private http:Http,
    [ng] ~~~~
    [ng] src/services/upload_assignment.ts:30:32 – error TS2709: Cannot use namespace ‘Platform’ as a type.
    [ng] 30 private platform : Platform,
    [ng] ~~~~~~~~
    [ng] src/services/upload_assignment.ts:32:32 – error TS2709: Cannot use namespace ‘ToastController’ as a type.
    [ng] 32 private toastCtrl: ToastController,
    [ng] ~~~~~~~~~~~~~~~
    [ng] src/services/upload_assignment.ts:35:34 – error TS2709: Cannot use namespace ‘LoadingController’ as a type.
    [ng] 35 private loadingCtrl:LoadingController
    [ng] ~~~~~~~~~~~~~~~~~
    [ng] src/services/users.ts:4:10 – error TS2305: Module ‘”C:/Users/Kenedy/Documents/ionic/projectname/node_modules/rxjs/Observable”‘ has no exported member ‘Observable’.
    [ng] 4 import { Observable } from ‘rxjs/Observable’;
    [ng] ~~~~~~~~~~
    [ng] src/services/users.ts:54:30 – error TS2709: Cannot use namespace ‘Http’ as a type.
    [ng] 54 constructor(private http:Http,
    [ng] ~~~~
    [ng] src/services/users.ts:58:27 – error TS2709: Cannot use namespace ‘ToastController’ as a type.
    [ng] 58 private toastCtrl:ToastController,
    [ng] ~~~~~~~~~~~~~~~
    [ng] src/services/users.ts:62:25 – error TS2709: Cannot use namespace ‘Camera’ as a type.
    [ng] 62 private camera: Camera,
    [ng] ~~~~~~
    [ng] src/services/wallet.ts:19:10 – error TS2305: Module ‘”C:/Users/Kenedy/Documents/ionic/projectname/node_modules/rxjs/Observable”‘ has no exported member ‘Observable’.
    [ng] 19 import { Observable } from ‘rxjs/Observable’;
    [ng] ~~~~~~~~~~
    [ng] src/services/wallet.ts:38:22 – error TS2709: Cannot use namespace ‘InAppPurchase’ as a type.
    [ng] 38 private iap: InAppPurchase,
    [ng] ~~~~~~~~~~~~~
    [ng] src/services/wallet.ts:40:22 – error TS2709: Cannot use namespace ‘Http’ as a type.
    [ng] 40 private http:Http,
    [ng] ~~~~
    [ng] src/services/wallet.ts:41:23 – error TS2709: Cannot use namespace ‘ToastController’ as a type.
    [ng] 41 private toast:ToastController,
    [ng] ~~~~~~~~~~~~~~~
    [ng] src/services/wallet.ts:42:29 – error TS2709: Cannot use namespace ‘LoadingController’ as a type.
    [ng] 42 private loadingCtrl:LoadingController) {
    [ng] ~~~~~~~~~~~~~~~~~
    [ng]

    [INFO] Development server running!

    Local: http://localhost:8100

    Use Ctrl+C to quit this process

    [INFO] Browser window opened to http://localhost:8100!

    STILL CNNOT GET Error

    #46461

    Maneesh Kumar
    Participant

    Hey I also getting the same error Cannot Get can you share your complete settings like all ng file versions and ionic version and Cordova plugin versions? it will help me to fix the issue or you have to produce a video for complete setup the for Android and Ios app.

    #46601

    Scott Lang
    Keymaster

    @Maneesh Please create a new topic regarding an issue which is you facing

    So that you can share the private reply there for your confidential detail.

Viewing 11 posts - 1 through 11 (of 11 total)
  • You must be logged in to reply to this topic.