Error Again

Back to course
Viewing 5 posts - 1 through 5 (of 5 total)
  • Author
    Posts
  • #14368

    Wiji Hatmoko
    Participant

    C:\Users\Wiji Hatmoko\Documents\Ionic\ciptacendekiaapp\platforms\android\app\build\intermediates\manifests\full\release\AndroidManifest.xml:55: error: resource string/fb_app_id (aka io.ionic.starter:string/fb_app_id) not found.

    C:\Users\Wiji Hatmoko\Documents\Ionic\ciptacendekiaapp\platforms\android\app\build\intermediates\manifests\full\release\AndroidManifest.xml:58: error: resource string/fb_app_name (aka io.ionic.starter:string/fb_app_name) not found.

    C:\Users\Wiji Hatmoko\Documents\Ionic\ciptacendekiaapp\platforms\android\app\build\intermediates\manifests\full\release\AndroidManifest.xml:62: error: resource string/fb_app_name (aka io.ionic.starter:string/fb_app_name) not found.

    error: failed processing manifest.

    Failed to execute aapt

    com.android.ide.common.process.ProcessException: Failed to execute aapt

    at com.android.builder.core.AndroidBuilder.processResources(AndroidBuilder.java:796)

    at com.android.build.gradle.tasks.ProcessAndroidResources.invokeAaptForSplit(ProcessAndroidResources.java:551)

    at com.android.build.gradle.tasks.ProcessAndroidResources.doFullTaskAction(ProcessAndroidResources.java:285)

    at com.android.build.gradle.internal.tasks.IncrementalTask.taskAction(IncrementalTask.java:109)

    at sun.reflect.NativeMethodAccessorImpl.invoke0(Native Method)

    :app:processReleaseResources FAILED

    25 actionable tasks: 1 executed, 24 up-to-date

    at sun.reflect.NativeMethodAccessorImpl.invoke(NativeMethodAccessorImpl.java:62)

    at sun.reflect.DelegatingMethodAccessorImpl.invoke(DelegatingMethodAccessorImpl.java:43)

    at java.lang.reflect.Method.invoke(Method.java:498)

    at org.gradle.internal.reflect.JavaMethod.invoke(JavaMethod.java:73)

    at org.gradle.api.internal.project.taskfactory.DefaultTaskClassInfoStore$IncrementalTaskAction.doExecute(DefaultTaskClassInfoStore.java:173)

    at org.gradle.api.internal.project.taskfactory.DefaultTaskClassInfoStore$StandardTaskAction.execute(DefaultTaskClassInfoStore.java:134)

    at org.gradle.api.internal.project.taskfactory.DefaultTaskClassInfoStore$StandardTaskAction.execute(DefaultTaskClassInfoStore.java:121)

    at org.gradle.api.internal.tasks.execution.ExecuteActionsTaskExecuter$1.run(ExecuteActionsTaskExecuter.java:122)

    at org.gradle.internal.progress.DefaultBuildOperationExecutor$RunnableBuildOperationWorker.execute(DefaultBuildOperationExecutor.java:336)

    at org.gradle.internal.progress.DefaultBuildOperationExecutor$RunnableBuildOperationWorker.execute(DefaultBuildOperationExecutor.java:328)

    at org.gradle.internal.progress.DefaultBuildOperationExecutor.execute(DefaultBuildOperationExecutor.java:197)

    at org.gradle.internal.progress.DefaultBuildOperationExecutor.run(DefaultBuildOperationExecutor.java:107)

    at org.gradle.api.internal.tasks.execution.ExecuteActionsTaskExecuter.executeAction(ExecuteActionsTaskExecuter.java:111)

    at org.gradle.api.internal.tasks.execution.ExecuteActionsTaskExecuter.executeActions(ExecuteActionsTaskExecuter.java:92)

    at org.gradle.api.internal.tasks.execution.ExecuteActionsTaskExecuter.execute(ExecuteActionsTaskExecuter.java:70)

    at org.gradle.api.internal.tasks.execution.SkipUpToDateTaskExecuter.execute(SkipUpToDateTaskExecuter.java:63)

    at org.gradle.api.internal.tasks.execution.ResolveTaskOutputCachingStateExecuter.execute(ResolveTaskOutputCachingStateExecuter.java:54)

    at org.gradle.api.internal.tasks.execution.ValidatingTaskExecuter.execute(ValidatingTaskExecuter.java:58)

    at org.gradle.api.internal.tasks.execution.SkipEmptySourceFilesTaskExecuter.execute(SkipEmptySourceFilesTaskExecuter.java:88)

    at org.gradle.api.internal.tasks.execution.ResolveTaskArtifactStateTaskExecuter.execute(ResolveTaskArtifactStateTaskExecuter.java:52)

    at org.gradle.api.internal.tasks.execution.SkipTaskWithNoActionsExecuter.execute(SkipTaskWithNoActionsExecuter.java:52)

    at org.gradle.api.internal.tasks.execution.SkipOnlyIfTaskExecuter.execute(SkipOnlyIfTaskExecuter.java:54)

    at org.gradle.api.internal.tasks.execution.ExecuteAtMostOnceTaskExecuter.execute(ExecuteAtMostOnceTaskExecuter.java:43)

    at org.gradle.api.internal.tasks.execution.CatchExceptionTaskExecuter.execute(CatchExceptionTaskExecuter.java:34)

    at org.gradle.execution.taskgraph.DefaultTaskGraphExecuter$EventFiringTaskWorker$1.run(DefaultTaskGraphExecuter.java:248)

    at org.gradle.internal.progress.DefaultBuildOperationExecutor$RunnableBuildOperationWorker.execute(DefaultBuildOperationExecutor.java:336)

    at org.gradle.internal.progress.DefaultBuildOperationExecutor$RunnableBuildOperationWorker.execute(DefaultBuildOperationExecutor.java:328)

    at org.gradle.internal.progress.DefaultBuildOperationExecutor.execute(DefaultBuildOperationExecutor.java:197)

    at org.gradle.internal.progress.DefaultBuildOperationExecutor.run(DefaultBuildOperationExecutor.java:107)

    at org.gradle.execution.taskgraph.DefaultTaskGraphExecuter$EventFiringTaskWorker.execute(DefaultTaskGraphExecuter.java:241)

    at org.gradle.execution.taskgraph.DefaultTaskGraphExecuter$EventFiringTaskWorker.execute(DefaultTaskGraphExecuter.java:230)

    at org.gradle.execution.taskgraph.DefaultTaskPlanExecutor$TaskExecutorWorker.processTask(DefaultTaskPlanExecutor.java:124)

    at org.gradle.execution.taskgraph.DefaultTaskPlanExecutor$TaskExecutorWorker.access$200(DefaultTaskPlanExecutor.java:80)

    at org.gradle.execution.taskgraph.DefaultTaskPlanExecutor$TaskExecutorWorker$1.execute(DefaultTaskPlanExecutor.java:105)

    at org.gradle.execution.taskgraph.DefaultTaskPlanExecutor$TaskExecutorWorker$1.execute(DefaultTaskPlanExecutor.java:99)

    at org.gradle.execution.taskgraph.DefaultTaskExecutionPlan.execute(DefaultTaskExecutionPlan.java:625)

    at org.gradle.execution.taskgraph.DefaultTaskExecutionPlan.executeWithTask(DefaultTaskExecutionPlan.java:580)

    at org.gradle.execution.taskgraph.DefaultTaskPlanExecutor$TaskExecutorWorker.run(DefaultTaskPlanExecutor.java:99)

    at org.gradle.internal.concurrent.ExecutorPolicy$CatchAndRecordFailures.onExecute(ExecutorPolicy.java:63)

    at org.gradle.internal.concurrent.ManagedExecutorImpl$1.run(ManagedExecutorImpl.java:46)

    at java.util.concurrent.ThreadPoolExecutor.runWorker(ThreadPoolExecutor.java:1149)

    at java.util.concurrent.ThreadPoolExecutor$Worker.run(ThreadPoolExecutor.java:624)

    at org.gradle.internal.concurrent.ThreadFactoryImpl$ManagedThreadRunnable.run(ThreadFactoryImpl.java:55)

    at java.lang.Thread.run(Thread.java:748)

    Caused by: java.util.concurrent.ExecutionException: java.util.concurrent.ExecutionException: com.android.tools.aapt2.Aapt2Exception: AAPT2 error: check logs for details

    at com.google.common.util.concurrent.AbstractFuture.getDoneValue(AbstractFuture.java:503)

    at com.google.common.util.concurrent.AbstractFuture.get(AbstractFuture.java:482)

    at com.google.common.util.concurrent.AbstractFuture$TrustedFuture.get(AbstractFuture.java:79)

    at com.android.builder.core.AndroidBuilder.processResources(AndroidBuilder.java:794)

    … 48 more

    Caused by: java.util.concurrent.ExecutionException: com.android.tools.aapt2.Aapt2Exception: AAPT2 error: check logs for details

    at com.google.common.util.concurrent.AbstractFuture.getDoneValue(AbstractFuture.java:503)

    at com.google.common.util.concurrent.AbstractFuture.get(AbstractFuture.java:462)

    at com.google.common.util.concurrent.AbstractFuture$TrustedFuture.get(AbstractFuture.java:79)

    at com.android.builder.internal.aapt.v2.QueueableAapt2.lambda$makeValidatedPackage$1(QueueableAapt2.java:179)

    at java.util.concurrent.ThreadPoolExecutor.runWorker(ThreadPoolExecutor.java:1149)

    at java.util.concurrent.ThreadPoolExecutor$Worker.run(ThreadPoolExecutor.java:624)

    … 1 more

    Caused by: com.android.tools.aapt2.Aapt2Exception: AAPT2 error: check logs for details

    at com.android.builder.png.AaptProcess$NotifierProcessOutput.handleOutput(AaptProcess.java:454)

    at com.android.builder.png.AaptProcess$NotifierProcessOutput.err(AaptProcess.java:411)

    at com.android.builder.png.AaptProcess$ProcessOutputFacade.err(AaptProcess.java:332)

    at com.android.utils.GrabProcessOutput$1.run(GrabProcessOutput.java:104)

    FAILURE: Build failed with an exception.

    * What went wrong:

    Execution failed for task ‘:app:processReleaseResources’.

    > Failed to execute aapt

    * Try:

    Run with –stacktrace option to get the stack trace. Run with –info or –debug option to get more log output.

    * Get more help at https://help.gradle.org

    BUILD FAILED in 48s

    (node:15204) UnhandledPromiseRejectionWarning: Error: cmd: Command failed with exit code 1 Error output:

    C:\Users\Wiji Hatmoko\Documents\Ionic\ciptacendekiaapp\platforms\android\app\build\intermediates\manifests\full\release\AndroidManifest.xml:55: AAPT: error: resource string/fb_app_id (aka io.ionic.starter:string/fb_app_id) not found.

    C:\Users\Wiji Hatmoko\Documents\Ionic\ciptacendekiaapp\platforms\android\app\build\intermediates\manifests\full\release\AndroidManifest.xml:58: AAPT: error: resource string/fb_app_name (aka io.ionic.starter:string/fb_app_name) not found.

    C:\Users\Wiji Hatmoko\Documents\Ionic\ciptacendekiaapp\platforms\android\app\build\intermediates\manifests\full\release\AndroidManifest.xml:62: AAPT: error: resource string/fb_app_name (aka io.ionic.starter:string/fb_app_name) not found.

    C:\Users\Wiji Hatmoko\Documents\Ionic\ciptacendekiaapp\platforms\android\app\build\intermediates\manifests\full\release\AndroidManifest.xml:55: error: resource string/fb_app_id (aka io.ionic.starter:string/fb_app_id) not found.

    C:\Users\Wiji Hatmoko\Documents\Ionic\ciptacendekiaapp\platforms\android\app\build\intermediates\manifests\full\release\AndroidManifest.xml:58: error: resource string/fb_app_name (aka io.ionic.starter:string/fb_app_name) not found.

    C:\Users\Wiji Hatmoko\Documents\Ionic\ciptacendekiaapp\platforms\android\app\build\intermediates\manifests\full\release\AndroidManifest.xml:62: error: resource string/fb_app_name (aka io.ionic.starter:string/fb_app_name) not found.

    error: failed processing manifest.

    Failed to execute aapt

    com.android.ide.common.process.ProcessException: Failed to execute aapt

    at com.android.builder.core.AndroidBuilder.processResources(AndroidBuilder.java:796)

    at com.android.build.gradle.tasks.ProcessAndroidResources.invokeAaptForSplit(ProcessAndroidResources.java:551)

    at com.android.build.gradle.tasks.ProcessAndroidResources.doFullTaskAction(ProcessAndroidResources.java:285)

    at com.android.build.gradle.internal.tasks.IncrementalTask.taskAction(IncrementalTask.java:109)

    at sun.reflect.NativeMethodAccessorImpl.invoke0(Native Method)

    at sun.reflect.NativeMethodAccessorImpl.invoke(NativeMethodAccessorImpl.java:62)

    at sun.reflect.DelegatingMethodAccessorImpl.invoke(DelegatingMethodAccessorImpl.java:43)

    at java.lang.reflect.Method.invoke(Method.java:498)

    at org.gradle.internal.reflect.JavaMethod.invoke(JavaMethod.java:73)

    at org.gradle.api.internal.project.taskfactory.DefaultTaskClassInfoStore$IncrementalTaskAction.doExecute(DefaultTaskClassInfoStore.java:173)

    at org.gradle.api.internal.project.taskfactory.DefaultTaskClassInfoStore$StandardTaskAction.execute(DefaultTaskClassInfoStore.java:134)

    at org.gradle.api.internal.project.taskfactory.DefaultTaskClassInfoStore$StandardTaskAction.execute(DefaultTaskClassInfoStore.java:121)

    at org.gradle.api.internal.tasks.execution.ExecuteActionsTaskExecuter$1.run(ExecuteActionsTaskExecuter.java:122)

    at org.gradle.internal.progress.DefaultBuildOperationExecutor$RunnableBuildOperationWorker.execute(DefaultBuildOperationExecutor.java:336)

    at org.gradle.internal.progress.DefaultBuildOperationExecutor$RunnableBuildOperationWorker.execute(DefaultBuildOperationExecutor.java:328)

    at org.gradle.internal.progress.DefaultBuildOperationExecutor.execute(DefaultBuildOperationExecutor.java:197)

    at org.gradle.internal.progress.DefaultBuildOperationExecutor.run(DefaultBuildOperationExecutor.java:107)

    at org.gradle.api.internal.tasks.execution.ExecuteActionsTaskExecuter.executeAction(ExecuteActionsTaskExecuter.java:111)

    at org.gradle.api.internal.tasks.execution.ExecuteActionsTaskExecuter.executeActions(ExecuteActionsTaskExecuter.java:92)

    at org.gradle.api.internal.tasks.execution.ExecuteActionsTaskExecuter.execute(ExecuteActionsTaskExecuter.java:70)

    at org.gradle.api.internal.tasks.execution.SkipUpToDateTaskExecuter.execute(SkipUpToDateTaskExecuter.java:63)

    at org.gradle.api.internal.tasks.execution.ResolveTaskOutputCachingStateExecuter.execute(ResolveTaskOutputCachingStateExecuter.java:54)

    at org.gradle.api.internal.tasks.execution.ValidatingTaskExecuter.execute(ValidatingTaskExecuter.java:58)

    at org.gradle.api.internal.tasks.execution.SkipEmptySourceFilesTaskExecuter.execute(SkipEmptySourceFilesTaskExecuter.java:88)

    at org.gradle.api.internal.tasks.execution.ResolveTaskArtifactStateTaskExecuter.execute(ResolveTaskArtifactStateTaskExecuter.java:52)

    at org.gradle.api.internal.tasks.execution.SkipTaskWithNoActionsExecuter.execute(SkipTaskWithNoActionsExecuter.java:52)

    at org.gradle.api.internal.tasks.execution.SkipOnlyIfTaskExecuter.execute(SkipOnlyIfTaskExecuter.java:54)

    at org.gradle.api.internal.tasks.execution.ExecuteAtMostOnceTaskExecuter.execute(ExecuteAtMostOnceTaskExecuter.java:43)

    at org.gradle.api.internal.tasks.execution.CatchExceptionTaskExecuter.execute(CatchExceptionTaskExecuter.java:34)

    at org.gradle.execution.taskgraph.DefaultTaskGraphExecuter$EventFiringTaskWorker$1.run(DefaultTaskGraphExecuter.java:248)

    at org.gradle.internal.progress.DefaultBuildOperationExecutor$RunnableBuildOperationWorker.execute(DefaultBuildOperationExecutor.java:336)

    at org.gradle.internal.progress.DefaultBuildOperationExecutor$RunnableBuildOperationWorker.execute(DefaultBuildOperationExecutor.java:328)

    at org.gradle.internal.progress.DefaultBuildOperationExecutor.execute(DefaultBuildOperationExecutor.java:197)

    at org.gradle.internal.progress.DefaultBuildOperationExecutor.run(DefaultBuildOperationExecutor.java:107)

    at org.gradle.execution.taskgraph.DefaultTaskGraphExecuter$EventFiringTaskWorker.execute(DefaultTaskGraphExecuter.java:241)

    at org.gradle.execution.taskgraph.DefaultTaskGraphExecuter$EventFiringTaskWorker.execute(DefaultTaskGraphExecuter.java:230)

    at org.gradle.execution.taskgraph.DefaultTaskPlanExecutor$TaskExecutorWorker.processTask(DefaultTaskPlanExecutor.java:124)

    at org.gradle.execution.taskgraph.DefaultTaskPlanExecutor$TaskExecutorWorker.access$200(DefaultTaskPlanExecutor.java:80)

    at org.gradle.execution.taskgraph.DefaultTaskPlanExecutor$TaskExecutorWorker$1.execute(DefaultTaskPlanExecutor.java:105)

    at org.gradle.execution.taskgraph.DefaultTaskPlanExecutor$TaskExecutorWorker$1.execute(DefaultTaskPlanExecutor.java:99)

    at org.gradle.execution.taskgraph.DefaultTaskExecutionPlan.execute(DefaultTaskExecutionPlan.java:625)

    at org.gradle.execution.taskgraph.DefaultTaskExecutionPlan.executeWithTask(DefaultTaskExecutionPlan.java:580)

    at org.gradle.execution.taskgraph.DefaultTaskPlanExecutor$TaskExecutorWorker.run(DefaultTaskPlanExecutor.java:99)

    at org.gradle.internal.concurrent.ExecutorPolicy$CatchAndRecordFailures.onExecute(ExecutorPolicy.java:63)

    at org.gradle.internal.concurrent.ManagedExecutorImpl$1.run(ManagedExecutorImpl.java:46)

    at java.util.concurrent.ThreadPoolExecutor.runWorker(ThreadPoolExecutor.java:1149)

    at java.util.concurrent.ThreadPoolExecutor$Worker.run(ThreadPoolExecutor.java:624)

    at org.gradle.internal.concurrent.ThreadFactoryImpl$ManagedThreadRunnable.run(ThreadFactoryImpl.java:55)

    at java.lang.Thread.run(Thread.java:748)

    Caused by: java.util.concurrent.ExecutionException: java.util.concurrent.ExecutionException: com.android.tools.aapt2.Aapt2Exception: AAPT2 error: check logs for details

    at com.google.common.util.concurrent.AbstractFuture.getDoneValue(AbstractFuture.java:503)

    at com.google.common.util.concurrent.AbstractFuture.get(AbstractFuture.java:482)

    at com.google.common.util.concurrent.AbstractFuture$TrustedFuture.get(AbstractFuture.java:79)

    at com.android.builder.core.AndroidBuilder.processResources(AndroidBuilder.java:794)

    … 48 more

    Caused by: java.util.concurrent.ExecutionException: com.android.tools.aapt2.Aapt2Exception: AAPT2 error: check logs for details

    at com.google.common.util.concurrent.AbstractFuture.getDoneValue(AbstractFuture.java:503)

    at com.google.common.util.concurrent.AbstractFuture.get(AbstractFuture.java:462)

    at com.google.common.util.concurrent.AbstractFuture$TrustedFuture.get(AbstractFuture.java:79)

    at com.android.builder.internal.aapt.v2.QueueableAapt2.lambda$makeValidatedPackage$1(QueueableAapt2.java:179)

    at java.util.concurrent.ThreadPoolExecutor.runWorker(ThreadPoolExecutor.java:1149)

    at java.util.concurrent.ThreadPoolExecutor$Worker.run(ThreadPoolExecutor.java:624)

    … 1 more

    Caused by: com.android.tools.aapt2.Aapt2Exception: AAPT2 error: check logs for details

    at com.android.builder.png.AaptProcess$NotifierProcessOutput.handleOutput(AaptProcess.java:454)

    at com.android.builder.png.AaptProcess$NotifierProcessOutput.err(AaptProcess.java:411)

    at com.android.builder.png.AaptProcess$ProcessOutputFacade.err(AaptProcess.java:332)

    at com.android.utils.GrabProcessOutput$1.run(GrabProcessOutput.java:104)

    FAILURE: Build failed with an exception.

    * What went wrong:

    Execution failed for task ‘:app:processReleaseResources’.

    > Failed to execute aapt

    * Try:

    Run with –stacktrace option to get the stack trace. Run with –info or –debug option to get more log output.

    * Get more help at https://help.gradle.org

    BUILD FAILED in 48s

    at ChildProcess.whenDone (C:\Users\Wiji Hatmoko\Documents\Ionic\ciptacendekiaapp\platforms\android\cordova\node_modules\cordova-common\src\superspawn.js:169:23)

    at emitTwo (events.js:126:13)

    at ChildProcess.emit (events.js:214:7)

    at maybeClose (internal/child_process.js:925:16)

    at Process.ChildProcess._handle.onexit (internal/child_process.js:209:5)

    (node:15204) UnhandledPromiseRejectionWarning: Unhandled promise rejection. This error originated either by throwing inside of an async function without a catch block, or by rejecting a promise which was not handled with .catch(). (rejection id: 1)

    (node:15204) [DEP0018] DeprecationWarning: Unhandled promise rejections are deprecated. In the future, promise rejections that are not handled will terminate the Node.js process with a non-zero exit code.

    C:\Users\Wiji Hatmoko\Documents\Ionic\ciptacendekiaapp>

    #14392

    admin
    Member
    Well I think this is due to facebook cordova plugin . Please run this command to remove it . cordova plugin rm cordova-plugin-facebook4 ionic cordova plugin add [email protected] --variable APP_ID="123456789" --variable APP_NAME="myApplication"
    #14437

    Wiji Hatmoko
    Participant
    How about app_id and app_name  ? Is 123456789 is true or I have to change it?
    #14438

    Wiji Hatmoko
    Participant
    C:\Users\Wiji Hatmoko\Documents\Ionic\ciptacendekiaapp>ionic cordova plugin add [email protected] --variable APP_ID="123456789" --variable APP_NAME="myApplication" > cordova plugin add [email protected] --variable APP_ID=123456789 --variable APP_NAME=myApplication --save Installing "cordova-plugin-facebook4" for android Android Studio project detected Error during processing of action! Attempting to revert... Failed to install 'cordova-plugin-facebook4': CordovaError: Uh oh! "C:\Users\Wiji Hatmoko\Documents\Ionic\ciptacendekiaapp\platforms\android\app\src\main\res\values\facebookconnect.xml" already exists! at copyNewFile (C:\Users\Wiji Hatmoko\Documents\Ionic\ciptacendekiaapp\platforms\android\cordova\lib\pluginHandlers.js:261:45) at install (C:\Users\Wiji Hatmoko\Documents\Ionic\ciptacendekiaapp\platforms\android\cordova\lib\pluginHandlers.js:51:17) at ActionStack.process (C:\Users\Wiji Hatmoko\Documents\Ionic\ciptacendekiaapp\platforms\android\cordova\node_modules\cordova-common\src\ActionStack.js:56:25) at PluginManager.doOperation (C:\Users\Wiji Hatmoko\Documents\Ionic\ciptacendekiaapp\platforms\android\cordova\node_modules\cordova-common\src\PluginManager.js:114:20) at PluginManager.addPlugin (C:\Users\Wiji Hatmoko\Documents\Ionic\ciptacendekiaapp\platforms\android\cordova\node_modules\cordova-common\src\PluginManager.js:144:17) at C:\Users\Wiji Hatmoko\Documents\Ionic\ciptacendekiaapp\platforms\android\cordova\Api.js:247:74 at _fulfilled (C:\Users\Wiji Hatmoko\Documents\Ionic\ciptacendekiaapp\platforms\android\cordova\node_modules\q\q.js:854:54) at self.promiseDispatch.done (C:\Users\Wiji Hatmoko\Documents\Ionic\ciptacendekiaapp\platforms\android\cordova\node_modules\q\q.js:883:30) at Promise.promise.promiseDispatch (C:\Users\Wiji Hatmoko\Documents\Ionic\ciptacendekiaapp\platforms\android\cordova\node_modules\q\q.js:816:13) (node:15680) UnhandledPromiseRejectionWarning: CordovaError: Uh oh! "C:\Users\Wiji Hatmoko\Documents\Ionic\ciptacendekiaapp\platforms\android\app\src\main\res\values\facebookconnect.xml" already exists! at copyNewFile (C:\Users\Wiji Hatmoko\Documents\Ionic\ciptacendekiaapp\platforms\android\cordova\lib\pluginHandlers.js:261:45) at install (C:\Users\Wiji Hatmoko\Documents\Ionic\ciptacendekiaapp\platforms\android\cordova\lib\pluginHandlers.js:51:17) at ActionStack.process (C:\Users\Wiji Hatmoko\Documents\Ionic\ciptacendekiaapp\platforms\android\cordova\node_modules\cordova-common\src\ActionStack.js:56:25) at PluginManager.doOperation (C:\Users\Wiji Hatmoko\Documents\Ionic\ciptacendekiaapp\platforms\android\cordova\node_modules\cordova-common\src\PluginManager.js:114:20) at PluginManager.addPlugin (C:\Users\Wiji Hatmoko\Documents\Ionic\ciptacendekiaapp\platforms\android\cordova\node_modules\cordova-common\src\PluginManager.js:144:17) at C:\Users\Wiji Hatmoko\Documents\Ionic\ciptacendekiaapp\platforms\android\cordova\Api.js:247:74 at _fulfilled (C:\Users\Wiji Hatmoko\Documents\Ionic\ciptacendekiaapp\platforms\android\cordova\node_modules\q\q.js:854:54) at self.promiseDispatch.done (C:\Users\Wiji Hatmoko\Documents\Ionic\ciptacendekiaapp\platforms\android\cordova\node_modules\q\q.js:883:30) at Promise.promise.promiseDispatch (C:\Users\Wiji Hatmoko\Documents\Ionic\ciptacendekiaapp\platforms\android\cordova\node_modules\q\q.js:816:13) at C:\Users\Wiji Hatmoko\Documents\Ionic\ciptacendekiaapp\platforms\android\cordova\node_modules\q\q.js:570:49 (node:15680) UnhandledPromiseRejectionWarning: Unhandled promise rejection. This error originated either by throwing inside of an async function without a catch block, or by rejecting a promise which was not handled with .catch(). (rejection id: 1) (node:15680) [DEP0018] DeprecationWarning: Unhandled promise rejections are deprecated. In the future, promise rejections that are not handled will terminate the Node.js process with a non-zero exit code. at C:\Users\Wiji Hatmoko\Documents\Ionic\ciptacendekiaapp\platforms\android\cordova\node_modules\q\q.js:570:49   C:\Users\Wiji Hatmoko\Documents\Ionic\ciptacendekiaapp>
    #14474

    admin
    Member
    Hi did you first  run this command or not :

    cordova plugin rm cordova-plugin-facebook4

      ?
Viewing 5 posts - 1 through 5 (of 5 total)
  • You must be logged in to reply to this topic.

izmir escort

antalya escort

izmir escort

antalya escort

izmir escort

bursa escort

porno izle

porno izle

porno izle

escort istanbul

instagram ucuz takipçi satın al

takipçi hilesi

takipçi satın al

instagram takipçi hilesi

takipçi satın al

instagram takipçi hilesi

izmir escort

bornova escort bayan

buca escort bayan

karşıyaka escort bayan

çeşme escort bayan

takipçi satın al

instagram takipçi satın al

instagram takipçi satın al

sex hikayesi

smm panel

haberler

istanbul escort

instagram takipçi satın al

instagram takipçi satın al

instagram takipçi satın al

twitter takipçi

tiktok takipçi satın al