problem build apk

This topic contains 3 replies, has 2 voices, and was last updated by  Alex 1 year, 6 months ago.

Viewing 4 posts - 1 through 4 (of 4 total)
  • Author
    Posts
  • #11155

    Jorge Olvera
    Participant

    I have a problem whe a run

    cordova build android –release

    Android Studio project detected

     

     

    UP-TO-DATE

    :app:splitsDiscoveryTaskRelease UP-TO-DATE

    :app:processReleaseResources

    /Volumes/falcon/System/Emprendeme/Emprendeme/CLIENTES/upscale media/appdev/rec/platforms/android/app/build/intermediates/manifests/full/release/AndroidManifest.xml:43: AAPT: error: resource string/fb_app_id (aka com.vibethemes.wplms:string/fb_app_id) not found.

     

    /Volumes/falcon/System/Emprendeme/Emprendeme/CLIENTES/upscale media/appdev/rec/platforms/android/app/build/intermediates/manifests/full/release/AndroidManifest.xml:46: AAPT: error: resource string/fb_app_name (aka com.vibethemes.wplms:string/fb_app_name) not found.

     

    /Volumes/falcon/System/Emprendeme/Emprendeme/CLIENTES/upscale media/appdev/rec/platforms/android/app/build/intermediates/manifests/full/release/AndroidManifest.xml:50: AAPT: error: resource string/fb_app_name (aka com.vibethemes.wplms:string/fb_app_name) not found.

     

    /Volumes/falcon/System/Emprendeme/Emprendeme/CLIENTES/upscale media/appdev/rec/platforms/android/app/build/intermediates/manifests/full/release/AndroidManifest.xml:43: error: resource string/fb_app_id (aka com.vibethemes.wplms:string/fb_app_id) not found.

    /Volumes/falcon/System/Emprendeme/Emprendeme/CLIENTES/upscale media/appdev/rec/platforms/android/app/build/intermediates/manifests/full/release/AndroidManifest.xml:46: error: resource string/fb_app_name (aka com.vibethemes.wplms:string/fb_app_name) not found.

    /Volumes/falcon/System/Emprendeme/Emprendeme/CLIENTES/upscale media/appdev/rec/platforms/android/app/build/intermediates/manifests/full/release/AndroidManifest.xml:50: error: resource string/fb_app_name (aka com.vibethemes.wplms:string/fb_app_name) not found.

    error: failed processing manifest.

     

    Failed to execute aapt

     

    com.android.ide.common.process.ProcessException: Failed to execute aapt

     

    at com.android.builder.core.AndroidBuilder.processResources(AndroidBuilder.java:796)

    at com.android.build.gradle.tasks.ProcessAndroidResources.invokeAaptForSplit(ProcessAndroidResources.java:551)

    at com.android.build.gradle.tasks.ProcessAndroidResources.doFullTaskAction(ProcessAndroidResources.java:285)

     

    at com.android.build.gradle.internal.tasks.IncrementalTask.taskAction(IncrementalTask.java:109)

     

    at sun.reflect.NativeMethodAccessorImpl.invoke0(Native Method)

    at sun.reflect.NativeMethodAccessorImpl.invoke(NativeMethodAccessorImpl.java:62)

     

    at sun.reflect.DelegatingMethodAccessorImpl.invoke(DelegatingMethodAccessorImpl.java:43)

     

    at java.lang.reflect.Method.invoke(Method.java:498)

    at org.gradle.internal.reflect.JavaMethod.invoke(JavaMethod.java:73)

     

    at org.gradle.api.internal.project.taskfactory.DefaultTaskClassInfoStore$IncrementalTaskAction.doExecute(DefaultTaskClassInfoStore.java:173)

    at org.gradle.api.internal.project.taskfactory.DefaultTaskClassInfoStore$StandardTaskAction.execute(DefaultTaskClassInfoStore.java:134)

    at org.gradle.api.internal.project.taskfactory.DefaultTaskClassInfoStore$StandardTaskAction.execute(DefaultTaskClassInfoStore.java:121)

    at org.gradle.api.internal.tasks.execution.ExecuteActionsTaskExecuter$1.run(ExecuteActionsTaskExecuter.java:122)

    at org.gradle.internal.progress.DefaultBuildOperationExecutor$RunnableBuildOperationWorker.execute(DefaultBuildOperationExecutor.java:336)

    at org.gradle.internal.progress.DefaultBuildOperationExecutor$RunnableBuildOperationWorker.execute(DefaultBuildOperationExecutor.java:328)

    at org.gradle.internal.progress.DefaultBuildOperationExecutor.execute(DefaultBuildOperationExecutor.java:197)

    at org.gradle.internal.progress.DefaultBuildOperationExecutor.run(DefaultBuildOperationExecutor.java:107)

     

    at org.gradle.api.internal.tasks.execution.ExecuteActionsTaskExecuter.executeAction(ExecuteActionsTaskExecuter.java:111)

     

    at org.gradle.api.internal.tasks.execution.ExecuteActionsTaskExecuter.executeActions(ExecuteActionsTaskExecuter.java:92)

     

    at org.gradle.api.internal.tasks.execution.ExecuteActionsTaskExecuter.execute(ExecuteActionsTaskExecuter.java:70)

     

    at org.gradle.api.internal.tasks.execution.SkipUpToDateTaskExecuter.execute(SkipUpToDateTaskExecuter.java:63)

     

    at org.gradle.api.internal.tasks.execution.ResolveTaskOutputCachingStateExecuter.execute(ResolveTaskOutputCachingStateExecuter.java:54)

     

    at org.gradle.api.internal.tasks.execution.ValidatingTaskExecuter.execute(ValidatingTaskExecuter.java:58)

     

    at org.gradle.api.internal.tasks.execution.SkipEmptySourceFilesTaskExecuter.execute(SkipEmptySourceFilesTaskExecuter.java:88)

    at org.gradle.api.internal.tasks.execution.ResolveTaskArtifactStateTaskExecuter.execute(ResolveTaskArtifactStateTaskExecuter.java:52)

     

    at org.gradle.api.internal.tasks.execution.SkipTaskWithNoActionsExecuter.execute(SkipTaskWithNoActionsExecuter.java:52)

    at org.gradle.api.internal.tasks.execution.SkipOnlyIfTaskExecuter.execute(SkipOnlyIfTaskExecuter.java:54)

     

    at org.gradle.api.internal.tasks.execution.ExecuteAtMostOnceTaskExecuter.execute(ExecuteAtMostOnceTaskExecuter.java:43)

     

    at org.gradle.api.internal.tasks.execution.CatchExceptionTaskExecuter.execute(CatchExceptionTaskExecuter.java:34)

     

    at org.gradle.execution.taskgraph.DefaultTaskGraphExecuter$EventFiringTaskWorker$1.run(DefaultTaskGraphExecuter.java:248)

     

    at org.gradle.internal.progress.DefaultBuildOperationExecutor$RunnableBuildOperationWorker.execute(DefaultBuildOperationExecutor.java:336)

    at org.gradle.internal.progress.DefaultBuildOperationExecutor$RunnableBuildOperationWorker.execute(DefaultBuildOperationExecutor.java:328)

     

    at org.gradle.internal.progress.DefaultBuildOperationExecutor.execute(DefaultBuildOperationExecutor.java:197)

     

    at org.gradle.internal.progress.DefaultBuildOperationExecutor.run(DefaultBuildOperationExecutor.java:107)

    at org.gradle.execution.taskgraph.DefaultTaskGraphExecuter$EventFiringTaskWorker.execute(DefaultTaskGraphExecuter.java:241)

     

    at org.gradle.execution.taskgraph.DefaultTaskGraphExecuter$EventFiringTaskWorker.execute(DefaultTaskGraphExecuter.java:230)

    at org.gradle.execution.taskgraph.DefaultTaskPlanExecutor$TaskExecutorWorker.processTask(DefaultTaskPlanExecutor.java:124)

     

    at org.gradle.execution.taskgraph.DefaultTaskPlanExecutor$TaskExecutorWorker.access$200(DefaultTaskPlanExecutor.java:80)

     

    at org.gradle.execution.taskgraph.DefaultTaskPlanExecutor$TaskExecutorWorker$1.execute(DefaultTaskPlanExecutor.java:105)

    at org.gradle.execution.taskgraph.DefaultTaskPlanExecutor$TaskExecutorWorker$1.execute(DefaultTaskPlanExecutor.java:99)

    at org.gradle.execution.taskgraph.DefaultTaskExecutionPlan.execute(DefaultTaskExecutionPlan.java:625)

     

    at org.gradle.execution.taskgraph.DefaultTaskExecutionPlan.executeWithTask(DefaultTaskExecutionPlan.java:580)

    at org.gradle.execution.taskgraph.DefaultTaskPlanExecutor$TaskExecutorWorker.run(DefaultTaskPlanExecutor.java:99)

    at org.gradle.internal.concurrent.ExecutorPolicy$CatchAndRecordFailures.onExecute(ExecutorPolicy.java:63)

    at org.gradle.internal.concurrent.ManagedExecutorImpl$1.run(ManagedExecutorImpl.java:46)

    at java.util.concurrent.ThreadPoolExecutor.runWorker(ThreadPoolExecutor.java:1142)

    at java.util.concurrent.ThreadPoolExecutor$Worker.run(ThreadPoolExecutor.java:617)

    at org.gradle.internal.concurrent.ThreadFactoryImpl$ManagedThreadRunnable.run(ThreadFactoryImpl.java:55)

     

    at java.lang.Thread.run(Thread.java:745)

    Caused by: java.util.concurrent.ExecutionException: java.util.concurrent.ExecutionException: com.android.tools.aapt2.Aapt2Exception: AAPT2 error: check logs for details

    at com.google.common.util.concurrent.AbstractFuture.getDoneValue(AbstractFuture.java:503)

    at com.google.common.util.concurrent.AbstractFuture.get(AbstractFuture.java:482)

    at com.google.common.util.concurrent.AbstractFuture$TrustedFuture.get(AbstractFuture.java:79)

    at com.android.builder.core.AndroidBuilder.processResources(AndroidBuilder.java:794)

    … 48 more

    Caused by: java.util.concurrent.ExecutionException: com.android.tools.aapt2.Aapt2Exception: AAPT2 error: check logs for details

    at com.google.common.util.concurrent.AbstractFuture.getDoneValue(AbstractFuture.java:503)

    at com.google.common.util.concurrent.AbstractFuture.get(AbstractFuture.java:462)

    at com.google.common.util.concurrent.AbstractFuture$TrustedFuture.get(AbstractFuture.java:79)

    at com.android.builder.internal.aapt.v2.QueueableAapt2.lambda$makeValidatedPackage$1(QueueableAapt2.java:179)

    at java.util.concurrent.ThreadPoolExecutor.runWorker(ThreadPoolExecutor.java:1142)

    at java.util.concurrent.ThreadPoolExecutor$Worker.run(ThreadPoolExecutor.java:617)

    … 1 more

     

    Caused by: com.android.tools.aapt2.Aapt2Exception: AAPT2 error: check logs for details

    at com.android.builder.png.AaptProcess$NotifierProcessOutput.handleOutput(AaptProcess.java:454)

    at com.android.builder.png.AaptProcess$NotifierProcessOutput.err(AaptProcess.java:411)

    at com.android.builder.png.AaptProcess$ProcessOutputFacade.err(AaptProcess.java:332)

    at com.android.utils.GrabProcessOutput$1.run(GrabProcessOutput.java:104)

     

    FAILED

     

    FAILURE: Build failed with an exception.

     

    * What went wrong:

    Execution failed for task ‘:app:processReleaseResources’.

    > Failed to execute aapt

     

    * Try:

    Run with –stacktrace option to get the stack trace. Run with –info or –debug option to get more log output.

     

    * Get more help at https://help.gradle.org

     

    BUILD FAILED

    in 5s

     

    25 actionable tasks: 1 executed, 24 up-to-date

     

    (node:42256) UnhandledPromiseRejectionWarning: Unhandled promise rejection (rejection id: 1): Error: /Volumes/falcon/System/Emprendeme/Emprendeme/CLIENTES/upscale media/appdev/rec/platforms/android/gradlew: Command failed with exit code 1 Error output:

    /Volumes/falcon/System/Emprendeme/Emprendeme/CLIENTES/upscale media/appdev/rec/platforms/android/app/build/intermediates/manifests/full/release/AndroidManifest.xml:43: AAPT: error: resource string/fb_app_id (aka com.vibethemes.wplms:string/fb_app_id) not found.

     

    /Volumes/falcon/System/Emprendeme/Emprendeme/CLIENTES/upscale media/appdev/rec/platforms/android/app/build/intermediates/manifests/full/release/AndroidManifest.xml:46: AAPT: error: resource string/fb_app_name (aka com.vibethemes.wplms:string/fb_app_name) not found.

     

    /Volumes/falcon/System/Emprendeme/Emprendeme/CLIENTES/upscale media/appdev/rec/platforms/android/app/build/intermediates/manifests/full/release/AndroidManifest.xml:50: AAPT: error: resource string/fb_app_name (aka com.vibethemes.wplms:string/fb_app_name) not found.

     

    /Volumes/falcon/System/Emprendeme/Emprendeme/CLIENTES/upscale media/appdev/rec/platforms/android/app/build/intermediates/manifests/full/release/AndroidManifest.xml:43: error: resource string/fb_app_id (aka com.vibethemes.wplms:string/fb_app_id) not found.

    /Volumes/falcon/System/Emprendeme/Emprendeme/CLIENTES/upscale media/appdev/rec/platforms/android/app/build/intermediates/manifests/full/release/AndroidManifest.xml:46: error: resource string/fb_app_name (aka com.vibethemes.wplms:string/fb_app_name) not found.

    /Volumes/falcon/System/Emprendeme/Emprendeme/CLIENTES/upscale media/appdev/rec/platforms/android/app/build/intermediates/manifests/full/release/AndroidManifest.xml:50: error: resource string/fb_app_name (aka com.vibethemes.wplms:string/fb_app_name) not found.

    error: failed processing manifest.

     

    Failed to execute aapt

    com.android.ide.common.process.ProcessException: Failed to execute aapt

    at com.android.builder.core.AndroidBuilder.processResources(AndroidBuilder.java:796)

    at com.android.build.gradle.tasks.ProcessAndroidResources.invokeAaptForSplit(ProcessAndroidResources.java:551)

    at com.android.build.gradle.tasks.ProcessAndroidResources.doFullTaskAction(ProcessAndroidResources.java:285)

    at com.android.build.gradle.internal.tasks.IncrementalTask.taskAction(IncrementalTask.java:109)

    at sun.reflect.NativeMethodAccessorImpl.invoke0(Native Method)

    at sun.reflect.NativeMethodAccessorImpl.invoke(NativeMethodAccessorImpl.java:62)

    at sun.reflect.DelegatingMethodAccessorImpl.invoke(DelegatingMethodAccessorImpl.java:43)

    at java.lang.reflect.Method.invoke(Method.java:498)

    at org.gradle.internal.reflect.JavaMethod.invoke(JavaMethod.java:73)

    at org.gradle.api.internal.project.taskfactory.DefaultTaskClassInfoStore$IncrementalTaskAction.doExecute(DefaultTaskClassInfoStore.java:173)

    at org.gradle.api.internal.project.taskfactory.DefaultTaskClassInfoStore$StandardTaskAction.execute(DefaultTaskClassInfoStore.java:134)

    at org.gradle.api.internal.project.taskfactory.DefaultTaskClassInfoStore$StandardTaskAction.execute(DefaultTaskClassInfoStore.java:121)

    at org.gradle.api.internal.tasks.execution.ExecuteActionsTaskExecuter$1.run(ExecuteActionsTaskExecuter.java:122)

    at org.gradle.internal.progress.DefaultBuildOperationExecutor$RunnableBuildOperationWorker.execute(DefaultBuildOperationExecutor.java:336)

    at org.gradle.internal.progress.DefaultBuildOperationExecutor$RunnableBuildOperationWorker.execute(DefaultBuildOperationExecutor.java:328)

    at org.gradle.internal.progress.DefaultBuildOperationExecutor.execute(DefaultBuildOperationExecutor.java:197)

    at org.gradle.internal.progress.DefaultBuildOperationExecutor.run(DefaultBuildOperationExecutor.java:107)

    at org.gradle.api.internal.tasks.execution.ExecuteActionsTaskExecuter.executeAction(ExecuteActionsTaskExecuter.java:111)

    at org.gradle.api.internal.tasks.execution.ExecuteActionsTaskExecuter.executeActions(ExecuteActionsTaskExecuter.java:92)

    at org.gradle.api.internal.tasks.execution.ExecuteActionsTaskExecuter.execute(ExecuteActionsTaskExecuter.java:70)

    at org.gradle.api.internal.tasks.execution.SkipUpToDateTaskExecuter.execute(SkipUpToDateTaskExecuter.java:63)

    at org.gradle.api.internal.tasks.execution.ResolveTaskOutputCachingStateExecuter.execute(ResolveTaskOutputCachingStateExecuter.java:54)

    at org.gradle.api.internal.tasks.execution.ValidatingTaskExecuter.execute(ValidatingTaskExecuter.java:58)

    at org.gradle.api.internal.tasks.execution.SkipEmptySourceFilesTaskExecuter.execute(SkipEmptySourceFilesTaskExecuter.java:88)

    at org.gradle.api.internal.tasks.execution.ResolveTaskArtifactStateTaskExecuter.execute(ResolveTaskArtifactStateTaskExecuter.java:52)

    at org.gradle.api.internal.tasks.execution.SkipTaskWithNoActionsExecuter.execute(SkipTaskWithNoActionsExecuter.java:52)

    at org.gradle.api.internal.tasks.execution.SkipOnlyIfTaskExecuter.execute(SkipOnlyIfTaskExecuter.java:54)

    at org.gradle.api.internal.tasks.execution.ExecuteAtMostOnceTaskExecuter.execute(ExecuteAtMostOnceTaskExecuter.java:43)

    at org.gradle.api.internal.tasks.execution.CatchExceptionTaskExecuter.execute(CatchExceptionTaskExecuter.java:34)

    at org.gradle.execution.taskgraph.DefaultTaskGraphExecuter$EventFiringTaskWorker$1.run(DefaultTaskGraphExecuter.java:248)

    at org.gradle.internal.progress.DefaultBuildOperationExecutor$RunnableBuildOperationWorker.execute(DefaultBuildOperationExecutor.java:336)

    at org.gradle.internal.progress.DefaultBuildOperationExecutor$RunnableBuildOperationWorker.execute(DefaultBuildOperationExecutor.java:328)

    at org.gradle.internal.progress.DefaultBuildOperationExecutor.execute(DefaultBuildOperationExecutor.java:197)

    at org.gradle.internal.progress.DefaultBuildOperationExecutor.run(DefaultBuildOperationExecutor.java:107)

    at org.gradle.execution.taskgraph.DefaultTaskGraphExecuter$EventFiringTaskWorker.execute(DefaultTaskGraphExecuter.java:241)

    at org.gradle.execution.taskgraph.DefaultTaskGraphExecuter$EventFiringTaskWorker.execute(DefaultTaskGraphExecuter.java:230)

    at org.gradle.execution.taskgraph.DefaultTaskPlanExecutor$TaskExecutorWorker.processTask(DefaultTaskPlanExecutor.java:124)

    at org.gradle.execution.taskgraph.DefaultTaskPlanExecutor$TaskExecutorWorker.access$200(DefaultTaskPlanExecutor.java:80)

    at org.gradle.execution.taskgraph.DefaultTaskPlanExecutor$TaskExecutorWorker$1.execute(DefaultTaskPlanExecutor.java:105)

    at org.gradle.execution.taskgraph.DefaultTaskPlanExecutor$TaskExecutorWorker$1.execute(DefaultTaskPlanExecutor.java:99)

    at org.gradle.execution.taskgraph.DefaultTaskExecutionPlan.execute(DefaultTaskExecutionPlan.java:625)

    at org.gradle.execution.taskgraph.DefaultTaskExecutionPlan.executeWithTask(DefaultTaskExecutionPlan.java:580)

    at org.gradle.execution.taskgraph.DefaultTaskPlanExecutor$TaskExecutorWorker.run(DefaultTaskPlanExecutor.java:99)

    at org.gradle.internal.concurrent.ExecutorPolicy$CatchAndRecordFailures.onExecute(ExecutorPolicy.java:63)

    at org.gradle.internal.concurrent.ManagedExecutorImpl$1.run(ManagedExecutorImpl.java:46)

    at java.util.concurrent.ThreadPoolExecutor.runWorker(ThreadPoolExecutor.java:1142)

    at java.util.concurrent.ThreadPoolExecutor$Worker.run(ThreadPoolExecutor.java:617)

    at org.gradle.internal.concurrent.ThreadFactoryImpl$ManagedThreadRunnable.run(ThreadFactoryImpl.java:55)

    at java.lang.Thread.run(Thread.java:745)

    Caused by: java.util.concurrent.ExecutionException: java.util.concurrent.ExecutionException: com.android.tools.aapt2.Aapt2Exception: AAPT2 error: check logs for details

    at com.google.common.util.concurrent.AbstractFuture.getDoneValue(AbstractFuture.java:503)

    at com.google.common.util.concurrent.AbstractFuture.get(AbstractFuture.java:482)

    at com.google.common.util.concurrent.AbstractFuture$TrustedFuture.get(AbstractFuture.java:79)

    at com.android.builder.core.AndroidBuilder.processResources(AndroidBuilder.java:794)

    … 48 more

    Caused by: java.util.concurrent.ExecutionException: com.android.tools.aapt2.Aapt2Exception: AAPT2 error: check logs for details

    at com.google.common.util.concurrent.AbstractFuture.getDoneValue(AbstractFuture.java:503)

    at com.google.common.util.concurr

    ent.AbstractFuture.get(AbstractFuture.java:462)

    at com.google.common.util.concurrent.AbstractFuture$TrustedFuture.get(AbstractFuture.java:79)

    at com.android.builder.internal.aapt.v2.QueueableAapt2.lambda$makeValidatedPackage$1(QueueableAapt2.java:179)

    at java.util.concurrent.ThreadPoolExecutor.runWorker(ThreadPoolExecutor.java:1142)

    at java.util.concurrent.ThreadPoolExecutor$Worker.run(ThreadPoolExecutor.java:617)

    … 1 more

    Caused by: com.android.tools.aapt2.Aapt2Exception: AAPT2 error: check logs for details

    at com.android.builder.png.AaptProcess$NotifierProcessOutput.handleOutput(AaptProcess.java:454)

    at com.android.builder.png.AaptProcess$NotifierProcessOutput.err(AaptProcess.java:411)

    at com.android.builder.png.AaptProcess$ProcessOutputFacade.err(AaptProcess.java:332)

    at com.android.utils.GrabProcessOutput$1.run(GrabProcessOutput.java:104)

     

    FAILURE: Build failed with an exception.

     

    * What went wrong:

    Execution failed for task ‘:app:processReleaseResources’.

    > Failed to execute aapt

     

    * Try:

    Run with –stacktrace option to get the stack trace. Run with –info or –debug option to get more log output.

     

    * Get more help at https://help.gradle.org

     

    BUILD FAILED in 5s

    #11170

    Alex
    Keymaster

    Please try running these commands :

     

    cordova platform rm android cordova platform add [email protected]

    #11185

    Jorge Olvera
    Participant

    thanks for response, now have this error

     

    :app:compileReleaseJavaWithJavac

    /Volumes/falcon/System/Emprendeme/Emprendeme/CLIENTES/upscale media/appdev/rec/platforms/android/app/src/main/java/com/alexdisler/inapppurchases/IabHelper.java:33: error: package com.android.vending.billing does not exist

     

    import com.android.vending.billing.IInAppBillingService;

    ^

    /Volumes/falcon/System/Emprendeme/Emprendeme/CLIENTES/upscale media/appdev/rec/platforms/android/app/src/main/java/com/alexdisler/inapppurchases/IabHelper.java:103: error: cannot find symbol

     

    IInAppBillingService mService;

    ^

    symbol:   class IInAppBillingService

     

    location: class IabHelper

    /Volumes/falcon/System/Emprendeme/Emprendeme/CLIENTES/upscale media/appdev/rec/platforms/android/app/src/main/java/com/alexdisler/inapppurchases/IabHelper.java:230: error: package IInAppBillingService does not exist

     

    mService = IInAppBillingService.Stub.asInterface(service);

    ^

    Note: Some input files use or override a deprecated API.

    Note: Recompile with -Xlint:deprecation for details.

    Note: Some input files use unchecked or unsafe operations.

    Note: Recompile with -Xlint:unchecked for details.

    3 errors

    FAILED

     

    FAILURE: Build failed with an exception.

     

    * What went wrong:

    Execution failed for task ‘:app:compileReleaseJavaWithJavac’.

    > Compilation failed; see the compiler error output for details.

     

    * Try:

    Run with –stacktrace option to get the stack trace. Run with –info or –debug option to get more log output.

     

    * Get more help at https://help.gradle.org

     

    BUILD FAILED in 32s

    39 actionable tasks: 39 executed

    (node:2228) UnhandledPromiseRejectionWarning: Error: /Volumes/falcon/System/Emprendeme/Emprendeme/CLIENTES/upscale media/appdev/rec/platforms/android/gradlew: Command failed with exit code 1 Error output:

    Note: Some input files use or override a deprecated API.

    Note: Recompile with -Xlint:deprecation for details.

    /Volumes/falcon/System/Emprendeme/Emprendeme/CLIENTES/upscale media/appdev/rec/platforms/android/app/src/main/java/com/alexdisler/inapppurchases/IabHelper.java:33: error: package com.android.vending.billing does not exist

    import com.android.vending.billing.IInAppBillingService;

    ^

    /Volumes/falcon/System/Emprendeme/Emprendeme/CLIENTES/upscale media/appdev/rec/platforms/android/app/src/main/java/com/alexdisler/inapppurchases/IabHelper.java:103: error: cannot find symbol

    IInAppBillingService mService;

    ^

    symbol:   class IInAppBillingService

    location: class IabHelper

    /Volumes/falcon/System/Emprendeme/Emprendeme/CLIENTES/upscale media/appdev/rec/platforms/android/app/src/main/java/com/alexdisler/inapppurchases/IabHelper.java:230: error: package IInAppBillingService does not exist

    mService = IInAppBillingService.Stub.asInterface(service);

    ^

    Note: Some input files use or override a deprecated API.

    Note: Recompile with -Xlint:deprecation for details.

    Note: Some input files use unchecked or unsafe operations.

    Note: Recompile with -Xlint:unchecked for details.

    3 errors

     

    FAILURE: Build failed with an exception.

     

    * What went wrong:

    Execution failed for task ‘:app:compileReleaseJavaWithJavac’.

    > Compilation failed; see the compiler error output for details.

     

    * Try:

    Run with –stacktrace option to get the stack trace. Run with –info or –debug option to get more log output.

     

    * Get more help at https://help.gradle.org

     

    BUILD FAILED in 32s

    at ChildProcess.whenDone (/Volumes/falcon/System/Emprendeme/Emprendeme/CLIENTES/upscale media/appdev/rec/platforms/android/cordova/node_modules/cordova-common/src/superspawn.js:169:23)

    at emitTwo (events.js:126:13)

    at ChildProcess.emit (events.js:214:7)

    at maybeClose (internal/child_process.js:925:16)

    at Socket.stream.socket.on (internal/child_process.js:346:11)

    at emitOne (events.js:116:13)

    at Socket.emit (events.js:211:7)

    at Pipe._handle.close [as _onclose] (net.js:567:12)

    (node:2228) UnhandledPromiseRejectionWarning: Unhandled promise rejection. This error originated either by throwing inside of an async function without a catch block, or by rejecting a promise which was not handled with .catch(). (rejection id: 1)

    (node:2228) [DEP0018] DeprecationWarning: Unhandled promise rejections are deprecated. In the future, promise rejections that are not handled will terminate the Node.js process with a non-zero exit code.

    #11200

    Alex
    Keymaster
Viewing 4 posts - 1 through 4 (of 4 total)

You must be logged in to reply to this topic.

Template Design © VibeThemes. All rights reserved.