problems with .apk generate

This topic contains 7 replies, has 2 voices, and was last updated by  Alex 1 year, 6 months ago.

Viewing 8 posts - 1 through 8 (of 8 total)
  • Author
    Posts
  • #11300

    Daniel
    Participant

    C:\Users\Nexcorp\Documents\ionic\wplms>ionic cordova build –release android

    #11301

    Daniel
    Participant

    [18:49:38]  tslint: C:/Users/Nexcorp/Documents/ionic/wplms/src/pages/home/home.ts, line: 27

    All imports are unused.

     

    L26:  import { FixedScrollHeader } from ‘../../components/fixed-scroll-header/fixed-scroll-header’;

    L27:  import { Coursecard } from ‘../../components/coursecard/coursecard’;

     

    [18:49:38]  tslint: C:/Users/Nexcorp/Documents/ionic/wplms/src/pages/home/home.ts, line: 30

    All imports are unused.

     

    L29:  import ‘rxjs/add/operator/map’;

    L30:  import { Observable } from ‘rxjs/Observable’;

    L31:  @Component({

     

    [18:49:38]  tslint: C:/Users/Nexcorp/Documents/ionic/wplms/src/pages/contact/contact.ts, line: 21

    Property ‘formBuilder’ is declared but its value is never read.

     

    L20:  constructor(public config: ConfigService,

    L21:      private formBuilder: FormBuilder,

    L22:      private toastCtrl:ToastController,

     

    [18:49:38]  tslint: C:/Users/Nexcorp/Documents/ionic/wplms/src/pages/contact/contact.ts, line: 3

    ‘FormBuilder’ is declared but its value is never read.

     

    L2:  import { ToastController, ModalController} from ‘ionic-angular’;

    L3:  import {Validators, FormBuilder, FormGroup } from ‘@angular/forms’;

     

    [18:49:38]  tslint: C:/Users/Nexcorp/Documents/ionic/wplms/src/pages/contact/contact.ts, line: 3

    ‘FormGroup’ is declared but its value is never read.

     

    L2:  import { ToastController, ModalController} from ‘ionic-angular’;

    L3:  import {Validators, FormBuilder, FormGroup } from ‘@angular/forms’;

     

    [18:49:38]  tslint: C:/Users/Nexcorp/Documents/ionic/wplms/src/pages/wishlist/wishlist.ts, line: 15

    Property ‘config’ is declared but its value is never read.

     

    L14:  private wishlistService:WishlistService,

    L15:  private config:ConfigService) {

     

    [18:49:38]  tslint: C:/Users/Nexcorp/Documents/ionic/wplms/src/pages/wishlist/wishlist.ts, line: 1

    ‘OnInit’ is declared but its value is never read.

     

    L1:  import { Component,OnInit } from ‘@angular/core’;

     

    [18:49:38]  tslint: C:/Users/Nexcorp/Documents/ionic/wplms/src/pages/wishlist/wishlist.ts, line: 5

    All imports are unused.

     

    L4:  import { WishlistService } from ‘../../services/wishlist’;

    L5:  import { Courseblock } from ‘../../components/courseblock/courseblock’;

    L6:  @Component({

     

    [18:49:38]  tslint: C:/Users/Nexcorp/Documents/ionic/wplms/src/pages/wallet/wallet.ts, line: 39

    Property ‘toast’ is declared but its value is never read.

     

    L38:  private config:ConfigService,

    L39:  private toast:ToastController,

    L40:  private nav:NavController,

     

    [18:49:38]  tslint: C:/Users/Nexcorp/Documents/ionic/wplms/src/pages/wallet/wallet.ts, line: 40

    Property ‘nav’ is declared but its value is never read.

     

    L39:  private toast:ToastController,

    L40:  private nav:NavController,

    L41:  private storage:Storage

     

    [18:49:38]  tslint: C:/Users/Nexcorp/Documents/ionic/wplms/src/pages/wallet/wallet.ts, line: 41

    Property ‘storage’ is declared but its value is never read.

     

    L40:  private nav:NavController,

    L41:  private storage:Storage

    L42:  ) {

     

    [18:49:38]  tslint: C:/Users/Nexcorp/Documents/ionic/wplms/src/pages/wallet/wallet.ts, line: 1

    ‘OnInit’ is declared but its value is never read.

     

    L1:  import { Component, OnInit , ViewChild} from ‘@angular/core’;

     

    [18:49:38]  tslint: C:/Users/Nexcorp/Documents/ionic/wplms/src/pages/wallet/wallet.ts, line: 3

    ‘LoadingController’ is declared but its value is never read.

     

    L3:  import { NavController,LoadingController, ToastController, Slides,Platform } from ‘ionic-angular’;

     

    [18:49:38]  tslint: C:/Users/Nexcorp/Documents/ionic/wplms/src/pages/wallet/wallet.ts, line: 3

    ‘Platform’ is declared but its value is never read.

     

    L3:  import { NavController,LoadingController, ToastController, Slides,Platform } from ‘ionic-angular’;

     

    [18:49:38]  tslint: C:/Users/Nexcorp/Documents/ionic/wplms/src/pages/wallet/wallet.ts, line: 8

    All imports are unused.

     

    L8:  import { Storage } from ‘@ionic/storage’;

    L9:  import { Wallet } from “../models/wallet”;

     

    [18:49:38]  tslint: C:/Users/Nexcorp/Documents/ionic/wplms/src/pages/wallet/wallet.ts, line: 9

    All imports are unused.

     

    L8:  import { Storage } from ‘@ionic/storage’;

    L9:  import { Wallet } from “../models/wallet”;

     

    [18:49:38]  tslint: C:/Users/Nexcorp/Documents/ionic/wplms/src/pages/wallet/wallet.ts, line: 12

    All imports are unused.

     

    L11:  import ‘rxjs/add/operator/map’;

    L12:  import { Observable } from ‘rxjs/Observable’;

     

    [18:49:38]  tslint: C:/Users/Nexcorp/Documents/ionic/wplms/src/pages/wallet/wallet.ts, line: 14

    All imports are unused.

     

    L14:  import { Chart } from ‘chart.js’;

     

    [18:49:38]  tslint: C:/Users/Nexcorp/Documents/ionic/wplms/src/services/updates.ts, line: 76

    ‘markRead’ is declared but its value is never read.

     

    L76:      private markRead(update){

    L77:              if(this.readupdates.length){

     

    [18:49:38]  tslint: C:/Users/Nexcorp/Documents/ionic/wplms/src/services/updates.ts, line: 99

    ‘markUnread’ is declared but its value is never read.

     

    L99:      private markUnread(update){

    L100:              if(this.readupdates.length){

     

    [18:49:38]  tslint: C:/Users/Nexcorp/Documents/ionic/wplms/src/services/updates.ts, line: 4

    All imports are unused.

     

    L4:  import { Storage } from ‘@ionic/storage’;

    L5:  import { ConfigService } from “./config”;

     

    [18:49:38]  tslint: C:/Users/Nexcorp/Documents/ionic/wplms/src/pages/updates/updates.ts, line: 1

    ‘OnInit’ is declared but its value is never read.

     

    L1:  import { Component, OnInit } from ‘@angular/core’;

    L2:  import { ViewController } from ‘ionic-angular’;

     

    [18:49:38]  tslint: C:/Users/Nexcorp/Documents/ionic/wplms/src/pages/updates/updates.ts, line: 6

    All imports are unused.

     

    L5:  import { UpdatesService } from ‘../../services/updates’;

    L6:  import { OrderPipe } from ‘../../pipes/orderby’;

    L7:  @Component({

     

    [18:49:38]  tslint: C:/Users/Nexcorp/Documents/ionic/wplms/src/pages/tabs/tabs.ts, line: 38

    Property ‘nav’ is declared but its value is never read.

     

    L37:  constructor(

    L38:    private nav: NavController,

    L39:    private navParams: NavParams,

     

    [18:49:38]  tslint: C:/Users/Nexcorp/Documents/ionic/wplms/src/pages/tabs/tabs.ts, line: 39

    Property ‘navParams’ is declared but its value is never read.

     

    L38:  private nav: NavController,

    L39:  private navParams: NavParams,

    L40:  private config:ConfigService,

     

    [18:49:38]  tslint: C:/Users/Nexcorp/Documents/ionic/wplms/src/pages/tabs/tabs.ts, line: 41

    Property ‘app’ is declared but its value is never read.

     

    L40:  private config:ConfigService,

    L41:  private app:App,

    L42:  private storage:Storage) {

     

    [18:49:38]  tslint: C:/Users/Nexcorp/Documents/ionic/wplms/src/pages/tabs/tabs.ts, line: 42

    Property ‘storage’ is declared but its value is never read.

     

    L41:  private app:App,

    L42:  private storage:Storage) {

     

    [18:49:38]  tslint: C:/Users/Nexcorp/Documents/ionic/wplms/src/pages/tabs/tabs.ts, line: 14

    All imports are unused.

     

    L13:  import { ConfigService } from ‘../../services/config’;

    L14:  import { Storage } from ‘@ionic/storage’;

     

    [18:49:38]  tslint: C:/Users/Nexcorp/Documents/ionic/wplms/src/pages/intro/intro.ts, line: 4

    All imports are unused.

     

    L3:  import { ConfigService } from ‘../../services/config’;

    L4:  import { Storage } from ‘@ionic/storage’;

    L5:  import { TabsPage } from ‘../tabs/tabs’;

     

    [18:49:38]  tslint: C:/Users/Nexcorp/Documents/ionic/wplms/src/pages/post/post.ts, line: 17

    Property ‘config’ is declared but its value is never read.

     

    L16:  private blog:BlogService,

    L17:  private config:ConfigService,

    L18:  private loadingController:LoadingController) {

     

    [18:49:38]  tslint: C:/Users/Nexcorp/Documents/ionic/wplms/src/pages/post/post.ts, line: 1

    ‘OnInit’ is declared but its value is never read.

     

    L1:  import { Component,OnInit } from ‘@angular/core’;

     

    [18:49:38]  tslint: C:/Users/Nexcorp/Documents/ionic/wplms/src/pages/blog/blog.ts, line: 1

    ‘OnInit’ is declared but its value is never read.

     

    L1:  import { Component, OnInit } from ‘@angular/core’;

     

    [18:49:38]  tslint: C:/Users/Nexcorp/Documents/ionic/wplms/src/pages/instructor/instructor.ts, line: 36

    Property ‘courseService’ is declared but its value is never read.

     

    L35:  private config:ConfigService,

    L36:  private courseService:CourseService,

    L37:  private userService:UserService,

     

    [18:49:38]  tslint: C:/Users/Nexcorp/Documents/ionic/wplms/src/pages/instructor/instructor.ts, line: 1

    ‘OnInit’ is declared but its value is never read.

     

    L1:  import { Component, OnInit,ViewChild } from ‘@angular/core’;

    L2:  import { NavController, NavParams,ViewController, Slides } from ‘ionic-angular’;

     

    [18:49:38]  tslint: C:/Users/Nexcorp/Documents/ionic/wplms/src/pages/instructors/instructors.ts, line: 1

    ‘OnInit’ is declared but its value is never read.

     

    L1:  import { Component, OnInit } from ‘@angular/core’;

    L2:  import { NavController, NavParams, ModalController,LoadingController } from ‘ionic-angular’;

     

    [18:49:38]  tslint: C:/Users/Nexcorp/Documents/ionic/wplms/src/app/app.component.ts, line: 33

    Property ‘platform’ is declared but its value is never read.

     

    L32:  constructor(private config:ConfigService,

    L33:      private platform: Platform,

    L34:      private menuCtrl: MenuController,

     

    [18:49:38]  tslint: C:/Users/Nexcorp/Documents/ionic/wplms/src/app/app.component.ts, line: 38

    Property ‘imgcacheService’ is declared but its value is never read.

     

    L37:  private storage:Storage,

    L38:  private imgcacheService:ImgcacheService,

    L39:  public splashScreen: SplashScreen) {

     

    [18:49:38]  tslint: C:/Users/Nexcorp/Documents/ionic/wplms/src/app/app.component.ts, line: 1

    ‘OnInit’ is declared but its value is never read.

     

    L1:  import { Component, OnInit, ViewChild } from ‘@angular/core’;

    L2:  import { App, Platform, NavController, MenuController,LoadingController } from ‘ionic-angular’;

     

    [18:49:38]  tslint: C:/Users/Nexcorp/Documents/ionic/wplms/src/app/app.component.ts, line: 14

    All imports are unused.

     

    L13:  import { ConfigService } from ‘../services/config’;

    L14:  import { Storage } from ‘@ionic/storage’;

    L15:  import { ImgcacheService } from ‘../services/imageCache’;

     

    [18:49:38]  tslint: C:/Users/Nexcorp/Documents/ionic/wplms/src/directives/lazy-load.directive.ts, line: 2

    ‘ElementRef’ is declared but its value is never read.

     

    L1:  import { Directive,

    L2:           ElementRef,

    L3:           EventEmitter,

     

    [18:49:38]  tslint: C:/Users/Nexcorp/Documents/ionic/wplms/src/directives/lazy-load.directive.ts, line: 6

    ‘OnInit’ is declared but its value is never read.

     

    L5:           Output,

    L6:           OnInit, OnDestroy, Renderer2 } from ‘@angular/core’;

     

    [18:49:38]  tslint: C:/Users/Nexcorp/Documents/ionic/wplms/src/directives/lazy-load.directive.ts, line: 6

    ‘OnDestroy’ is declared but its value is never read.

     

    L5:           Output,

    L6:           OnInit, OnDestroy, Renderer2 } from ‘@angular/core’;

     

    [18:49:38]  tslint: C:/Users/Nexcorp/Documents/ionic/wplms/src/directives/lazy-load.directive.ts, line: 6

    ‘Renderer2’ is declared but its value is never read.

     

    L5:           Output,

    L6:           OnInit, OnDestroy, Renderer2 } from ‘@angular/core’;

     

    [18:49:38]  tslint: …rs/Nexcorp/Documents/ionic/wplms/src/components/elastic-header/elastic-header.ts, line: 1

    ‘ElementRef’ is declared but its value is never read.

     

    L1:  import { Directive, ElementRef, Renderer } from ‘@angular/core’;

     

    [18:49:38]  tslint: …rs/Nexcorp/Documents/ionic/wplms/src/components/elastic-header/elastic-header.ts, line: 1

    ‘Renderer’ is declared but its value is never read.

     

    L1:  import { Directive, ElementRef, Renderer } from ‘@angular/core’;

     

    [18:49:38]  tslint: …/Documents/ionic/wplms/src/components/avatarscrollzoomout/avatarscrollzoomout.ts, line: 1

    ‘ElementRef’ is declared but its value is never read.

     

    L1:  import { Directive, ElementRef, Renderer } from ‘@angular/core’;

     

    [18:49:38]  tslint: …/Documents/ionic/wplms/src/components/avatarscrollzoomout/avatarscrollzoomout.ts, line: 1

    ‘Renderer’ is declared but its value is never read.

     

    L1:  import { Directive, ElementRef, Renderer } from ‘@angular/core’;

     

    [18:49:38]  tslint: C:/Users/Nexcorp/Documents/ionic/wplms/src/components/pipefilters.ts, line: 1

    ‘PipeTransform’ is declared but its value is never read.

     

    L1:  import { PipeTransform, Pipe, Injectable } from ‘@angular/core’;

     

    [18:49:38]  tslint: …/Nexcorp/Documents/ionic/wplms/src/components/instructorblock/instructorblock.ts, line: 17

    Property ‘config’ is declared but its value is never read.

     

    L16:   @Input(‘instructor’) instructor;

    L17:  constructor(private config:ConfigService) {

     

    [18:49:38]  tslint: …/Nexcorp/Documents/ionic/wplms/src/components/instructorblock/instructorblock.ts, line: 1

    ‘OnInit’ is declared but its value is never read.

     

    L1:  import { Component, Input, OnInit } from ‘@angular/core’;

     

    [18:49:38]  tslint: C:/Users/Nexcorp/Documents/ionic/wplms/src/components/match/match.ts, line: 9

    Property ‘elementRef’ is declared but its value is never read.

     

    L9:    constructor(private elementRef: ElementRef) {

     

    [18:49:38]  tslint: C:/Users/Nexcorp/Documents/ionic/wplms/src/components/match/match.ts, line: 1

    ‘ElementRef’ is declared but its value is never read.

     

    L1:  import { Directive,ElementRef, OnInit } from ‘@angular/core’;

     

    [18:49:38]  tslint: C:/Users/Nexcorp/Documents/ionic/wplms/src/components/match/match.ts, line: 1

    ‘OnInit’ is declared but its value is never read.

     

    L1:  import { Directive,ElementRef, OnInit } from ‘@angular/core’;

     

    [18:49:38]  tslint: C:/Users/Nexcorp/Documents/ionic/wplms/src/components/fillblank/fillblank.ts, line: 8

    Property ‘elementRef’ is declared but its value is never read.

     

    L8:    constructor(private elementRef: ElementRef) {

     

    [18:49:38]  tslint: C:/Users/Nexcorp/Documents/ionic/wplms/src/components/fillblank/fillblank.ts, line: 1

    ‘ElementRef’ is declared but its value is never read.

     

    L1:  import { Directive,ElementRef, OnInit } from ‘@angular/core’;

     

    [18:49:38]  tslint: C:/Users/Nexcorp/Documents/ionic/wplms/src/components/fillblank/fillblank.ts, line: 1

    ‘OnInit’ is declared but its value is never read.

     

    L1:  import { Directive,ElementRef, OnInit } from ‘@angular/core’;

     

    [18:49:38]  tslint: C:/Users/Nexcorp/Documents/ionic/wplms/src/components/select/select.ts, line: 1

    ‘ElementRef’ is declared but its value is never read.

     

    L1:  import { Directive,ElementRef, OnInit } from ‘@angular/core’;

     

    [18:49:38]  tslint: C:/Users/Nexcorp/Documents/ionic/wplms/src/components/select/select.ts, line: 1

    ‘OnInit’ is declared but its value is never read.

     

    L1:  import { Directive,ElementRef, OnInit } from ‘@angular/core’;

     

    [18:49:38]  tslint: C:/Users/Nexcorp/Documents/ionic/wplms/src/components/FormValidator.ts, line: 2

    ‘Validator’ is declared but its value is never read.

     

    L1:  import { Directive } from ‘@angular/core’;

    L2:  import { Validator, AbstractControl, NG_VALIDATORS } from ‘@angular/forms’;

     

    [18:49:38]  tslint: C:/Users/Nexcorp/Documents/ionic/wplms/src/components/FormValidator.ts, line: 2

    ‘AbstractControl’ is declared but its value is never read.

     

    L1:  import { Directive } from ‘@angular/core’;

    L2:  import { Validator, AbstractControl, NG_VALIDATORS } from ‘@angular/forms’;

     

    [18:49:38]  tslint: C:/Users/Nexcorp/Documents/ionic/wplms/src/components/swipedtab/swipedtab.ts, line: 1

    ‘ElementRef’ is declared but its value is never read.

     

    L1:  import { Component, ElementRef, Input, Renderer } from ‘@angular/core’;

     

    [18:49:38]  tslint: C:/Users/Nexcorp/Documents/ionic/wplms/src/components/swipedtab/swipedtab.ts, line: 1

    C:\Users\Nexcorp\Documents\ionic\wplms\platforms\android\app\build\intermediates\manifests\full\release\AndroidManifest.xml:55: AAPT: error: resource string/fb_app_id (aka com.vibethemes.wplms:string/fb_app_id) not found.

    L1:  import { Component, ElementRef, Input, Renderer } from ‘@angular/core’;

    C:\Users\Nexcorp\Documents\ionic\wplms\platforms\android\app\build\intermediates\manifests\full\release\AndroidManifest.xml:58: AAPT: error: resource string/fb_app_name (aka com.vibethemes.wplms:string/fb_app_name) not found.

    Property ‘config’ is declared but its value is never read.

    C:\Users\Nexcorp\Documents\ionic\wplms\platforms\android\app\build\intermediates\manifests\full\release\AndroidManifest.xml:62: AAPT: error: resource string/fb_app_name (aka com.vibethemes.wplms:string/fb_app_name) not found.

    L24:  private config:ConfigService) {

    C:\Users\Nexcorp\Documents\ionic\wplms\platforms\android\app\build\intermediates\manifests\full\release\AndroidManifest.xml:55: error: resource string/fb_app_id (aka com.vibethemes.wplms:string/fb_app_id) not found.ne: 2

    FAILED

    25 actionable tasks: 1 executed, 24 up-to-date

    C:\Users\Nexcorp\Documents\ionic\wplms\platforms\android\app\build\intermediates\manifests\full\release\AndroidManifest.xml:58: error: resource string/fb_app_name (aka com.vibethemes.wplms:string/fb_app_name) not found.

    C:\Users\Nexcorp\Documents\ionic\wplms\platforms\android\app\build\intermediates\manifests\full\release\AndroidManifest.xml:62: error: resource string/fb_app_name (aka com.vibethemes.wplms:string/fb_app_name) not found.

    error: failed processing manifest.

    [18:49:38]  tslint: C:/Users/Nexcorp/Documents/ionic/wplms/src/validators/email.ts, line: 1

    Failed to execute aapts are unused.

    com.android.ide.common.process.ProcessException: Failed to execute aapt

    Lat com.android.builder.core.AndroidBuilder.processResources(AndroidBuilder.java:796)

    at com.android.build.gradle.tasks.ProcessAndroidResources.invokeAaptForSplit(ProcessAndroidResources.java:551)

    [18:49:3at com.android.build.gradle.tasks.ProcessAndroidResources.doFullTaskAction(ProcessAndroidResources.java:285)

    at com.android.build.gradle.internal.tasks.IncrementalTask.taskAction(IncrementalTask.java:109)

    at sun.reflect.NativeMethodAccessorImpl.invoke0(Native Method)

    Lat sun.reflect.NativeMethodAccessorImpl.invoke(NativeMethodAccessorImpl.java:62)

    at sun.reflect.DelegatingMethodAccessorImpl.invoke(DelegatingMethodAccessorImpl.java:43)

    [18:49:3at java.lang.reflect.Method.invoke(Method.java:498)

    at org.gradle.internal.reflect.JavaMethod.invoke(JavaMethod.java:73)

    C:\Usersat org.gradle.api.internal.project.taskfactory.DefaultTaskClassInfoStore$IncrementalTaskAction.doExecute(DefaultTaskClassInfoStore.java:173)-platform android –target cordova

    [18:50:3at org.gradle.api.internal.project.taskfactory.DefaultTaskClassInfoStore$StandardTaskAction.execute(DefaultTaskClassInfoStore.java:134)ed …

    [18:50:3at org.gradle.api.internal.project.taskfactory.DefaultTaskClassInfoStore$StandardTaskAction.execute(DefaultTaskClassInfoStore.java:121)d …

    [18:50:3at org.gradle.api.internal.tasks.execution.ExecuteActionsTaskExecuter$1.run(ExecuteActionsTaskExecuter.java:122)

    [18:50:3at org.gradle.internal.progress.DefaultBuildOperationExecutor$RunnableBuildOperationWorker.execute(DefaultBuildOperationExecutor.java:336)ted …

    [18:50:3at org.gradle.internal.progress.DefaultBuildOperationExecutor$RunnableBuildOperationWorker.execute(DefaultBuildOperationExecutor.java:328)rted …

    [18:50:3at org.gradle.internal.progress.DefaultBuildOperationExecutor.execute(DefaultBuildOperationExecutor.java:197)

    [18:50:3at org.gradle.internal.progress.DefaultBuildOperationExecutor.run(DefaultBuildOperationExecutor.java:107)

    [18:50:3at org.gradle.api.internal.tasks.execution.ExecuteActionsTaskExecuter.executeAction(ExecuteActionsTaskExecuter.java:111)6]  webpack finished in 7.52 s

    [18:50:4at org.gradle.api.internal.tasks.execution.ExecuteActionsTaskExecuter.executeActions(ExecuteActionsTaskExecuter.java:92)7]  sass finished in 1.10 s

    [18:50:4at org.gradle.api.internal.tasks.execution.ExecuteActionsTaskExecuter.execute(ExecuteActionsTaskExecuter.java:70)18:50:47]  postprocess finished in 9 ms

    [18:50:4at org.gradle.api.internal.tasks.execution.SkipUpToDateTaskExecuter.execute(SkipUpToDateTaskExecuter.java:63)

    [18:50:4at org.gradle.api.internal.tasks.execution.ResolveTaskOutputCachingStateExecuter.execute(ResolveTaskOutputCachingStateExecuter.java:54) –release

    Android at org.gradle.api.internal.tasks.execution.ValidatingTaskExecuter.execute(ValidatingTaskExecuter.java:58)

    at org.gradle.api.internal.tasks.execution.SkipEmptySourceFilesTaskExecuter.execute(SkipEmptySourceFilesTaskExecuter.java:88)C:\Users\Nexcorp\AppData\Local\Android\Sdk

    JAVA_HOMat org.gradle.api.internal.tasks.execution.ResolveTaskArtifactStateTaskExecuter.execute(ResolveTaskArtifactStateTaskExecuter.java:52)

    Subprojeat org.gradle.api.internal.tasks.execution.SkipTaskWithNoActionsExecuter.execute(SkipTaskWithNoActionsExecuter.java:52)ect Path: app

    publishNat org.gradle.api.internal.tasks.execution.SkipOnlyIfTaskExecuter.execute(SkipOnlyIfTaskExecuter.java:54)

    at org.gradle.api.internal.tasks.execution.ExecuteAtMostOnceTaskExecuter.execute(ExecuteAtMostOnceTaskExecuter.java:43)k.leftShift(Closure) method has been deprecated and is scheduled to be removed in Gradle 5.0. Please use Task.doL

    ast(Actiat org.gradle.api.internal.tasks.execution.CatchExceptionTaskExecuter.execute(CatchExceptionTaskExecuter.java:34)       at build_4patict3zccmo1j8jeng0y3li.run(C:\Users\Nexcorp\Documents\ionic\wplms\platforms\android\app\build.gradle

    :143)   at org.gradle.execution.taskgraph.DefaultTaskGraphExecuter$EventFiringTaskWorker$1.run(DefaultTaskGraphExecuter.java:248)tion ‘compile’ in project ‘:app’ is deprecated. Use ‘implementation’ instead.

    :Cordovaat org.gradle.internal.progress.DefaultBuildOperationExecutor$RunnableBuildOperationWorker.execute(DefaultBuildOperationExecutor.java:336)

    :Cordovaat org.gradle.internal.progress.DefaultBuildOperationExecutor$RunnableBuildOperationWorker.execute(DefaultBuildOperationExecutor.java:328)Aidl

    UP-TO-Dat org.gradle.internal.progress.DefaultBuildOperationExecutor.execute(DefaultBuildOperationExecutor.java:197)

    :Cordovaat org.gradle.internal.progress.DefaultBuildOperationExecutor.run(DefaultBuildOperationExecutor.java:107)

    :Cordovaat org.gradle.execution.taskgraph.DefaultTaskGraphExecuter$EventFiringTaskWorker.execute(DefaultTaskGraphExecuter.java:241):generateReleaseBuildConfig UP-TO-DATE

    :Cordovaat org.gradle.execution.taskgraph.DefaultTaskGraphExecuter$EventFiringTaskWorker.execute(DefaultTaskGraphExecuter.java:230):generateReleaseResValues UP-TO-DATE

    :Cordovaat org.gradle.execution.taskgraph.DefaultTaskPlanExecutor$TaskExecutorWorker.processTask(DefaultTaskPlanExecutor.java:124)b:packageReleaseResources UP-TO-DATE

    :Cordovaat org.gradle.execution.taskgraph.DefaultTaskPlanExecutor$TaskExecutorWorker.access$200(DefaultTaskPlanExecutor.java:80)Lib:processReleaseManifest UP-TO-DATE

    :Cordovaat org.gradle.execution.taskgraph.DefaultTaskPlanExecutor$TaskExecutorWorker$1.execute(DefaultTaskPlanExecutor.java:105)Lib:generateReleaseSources UP-TO-DATE

    :Cordovaat org.gradle.execution.taskgraph.DefaultTaskPlanExecutor$TaskExecutorWorker$1.execute(DefaultTaskPlanExecutor.java:99)aLib:compileReleaseJavaWithJavac UP-TO-DATE

    :Cordovaat org.gradle.execution.taskgraph.DefaultTaskExecutionPlan.execute(DefaultTaskExecutionPlan.java:625)

    :Cordovaat org.gradle.execution.taskgraph.DefaultTaskExecutionPlan.executeWithTask(DefaultTaskExecutionPlan.java:580)

    :app:preat org.gradle.execution.taskgraph.DefaultTaskPlanExecutor$TaskExecutorWorker.run(DefaultTaskPlanExecutor.java:99)app:preReleaseBuild

    [18:50:5at org.gradle.internal.concurrent.ExecutorPolicy$CatchAndRecordFailures.onExecute(ExecutorPolicy.java:63)

    at org.gradle.internal.concurrent.ManagedExecutorImpl$1.run(ManagedExecutorImpl.java:46)

    at java.util.concurrent.ThreadPoolExecutor.runWorker(ThreadPoolExecutor.java:1149)

    Lat java.util.concurrent.ThreadPoolExecutor$Worker.run(ThreadPoolExecutor.java:624)

    Lat org.gradle.internal.concurrent.ThreadFactoryImpl$ManagedThreadRunnable.run(ThreadFactoryImpl.java:55)

    Lat java.lang.Thread.run(Thread.java:748)age’;

    Caused by: java.util.concurrent.ExecutionException: java.util.concurrent.ExecutionException: com.android.tools.aapt2.Aapt2Exception: AAPT2 error: check logs for detailsonic/wplms/src/services/config.ts, line: 3

    at com.google.common.util.concurrent.AbstractFuture.getDoneValue(AbstractFuture.java:503)

    at com.google.common.util.concurrent.AbstractFuture.get(AbstractFuture.java:482)

    Lat com.google.common.util.concurrent.AbstractFuture$TrustedFuture.get(AbstractFuture.java:79)

    Lat com.android.builder.core.AndroidBuilder.processResources(AndroidBuilder.java:794)

    … 48 more

    Caused by: java.util.concurrent.ExecutionException: com.android.tools.aapt2.Aapt2Exception: AAPT2 error: check logs for details     All imports are unused.

    at com.google.common.util.concurrent.AbstractFuture.getDoneValue(AbstractFuture.java:503)

    Lat com.google.common.util.concurrent.AbstractFuture.get(AbstractFuture.java:462)

    at com.google.common.util.concurrent.AbstractFuture$TrustedFuture.get(AbstractFuture.java:79)

    [18:50:5at com.android.builder.internal.aapt.v2.QueueableAapt2.lambda$makeValidatedPackage$1(QueueableAapt2.java:179)

    at java.util.concurrent.ThreadPoolExecutor.runWorker(ThreadPoolExecutor.java:1149)

    at java.util.concurrent.ThreadPoolExecutor$Worker.run(ThreadPoolExecutor.java:624)

    L4… 1 moree observable: Observable<any>; //Tracks request in progress

    Caused by: com.android.tools.aapt2.Aapt2Exception: AAPT2 error: check logs for details

    L4at com.android.builder.png.AaptProcess$NotifierProcessOutput.handleOutput(AaptProcess.java:454)

    at com.android.builder.png.AaptProcess$NotifierProcessOutput.err(AaptProcess.java:411)

    [18:50:5at com.android.builder.png.AaptProcess$ProcessOutputFacade.err(AaptProcess.java:332)ine: 104

    at com.android.utils.GrabProcessOutput$1.run(GrabProcessOutput.java:104)

     

    FAILURE: Build failed with an exception.

    L105:          this.headers = this.storage.get(‘token’).then((token) => {

    * What went wrong:

    Execution failed for task ‘:app:processReleaseResources’.s/src/services/authentication.ts, line: 251

    > Failed to execute aaptlared but its value is never read.

     

    * Try:250:  let  permissions = [“public_profile”,”email”];

    Run with –stacktrace option to get the stack trace. Run with –info or –debug option to get more log output.

    L252:  //let env = this;

    * Get more help at https://help.gradle.org

    [18:50:53]  tslint: C:/Users/Nexcorp/Documents/ionic/wplms/src/services/authentication.ts, line: 2

    BUILD FAILED in 12sis declared but its value is never read.

    (node:1368) UnhandledPromiseRejectionWarning: Error: cmd: Command failed with exit code 1 Error output:

    C:\Users\Nexcorp\Documents\ionic\wplms\platforms\android\app\build\intermediates\manifests\full\release\AndroidManifest.xml:55: AAPT: error: resource string/fb_app_id (aka com.vibethemes.wplms:string/fb_app_id) not found.

    L3:  import { Platform, LoadingController, ToastController } from ‘ionic-angular’;

    C:\Users\Nexcorp\Documents\ionic\wplms\platforms\android\app\build\intermediates\manifests\full\release\AndroidManifest.xml:58: AAPT: error: resource string/fb_app_name (aka com.vibethemes.wplms:string/fb_app_name) not found.

    ‘Response’ is declared but its value is never read.

    C:\Users\Nexcorp\Documents\ionic\wplms\platforms\android\app\build\intermediates\manifests\full\release\AndroidManifest.xml:62: AAPT: error: resource string/fb_app_name (aka com.vibethemes.wplms:string/fb_app_name) not found.

    L2:  import { Http, Headers, Response, RequestOptions, URLSearchParams } from ‘@angular/http’;

    C:\Users\Nexcorp\Documents\ionic\wplms\platforms\android\app\build\intermediates\manifests\full\release\AndroidManifest.xml:55: error: resource string/fb_app_id (aka com.vibethemes.wplms:string/fb_app_id) not found.

    C:\Users\Nexcorp\Documents\ionic\wplms\platforms\android\app\build\intermediates\manifests\full\release\AndroidManifest.xml:58: error: resource string/fb_app_name (aka com.vibethemes.wplms:string/fb_app_name) not found.

    C:\Users\Nexcorp\Documents\ionic\wplms\platforms\android\app\build\intermediates\manifests\full\release\AndroidManifest.xml:62: error: resource string/fb_app_name (aka com.vibethemes.wplms:string/fb_app_name) not found.

    error: failed processing manifest., Response, RequestOptions, URLSearchParams } from ‘@angular/http’;

    L3:  import { Platform, LoadingController, ToastController } from ‘ionic-angular’;

    Failed to execute aapt

    com.android.ide.common.process.ProcessException: Failed to execute aapt/authentication.ts, line: 14

    at com.android.builder.core.AndroidBuilder.processResources(AndroidBuilder.java:796)

    at com.android.build.gradle.tasks.ProcessAndroidResources.invokeAaptForSplit(ProcessAndroidResources.java:551)

    L1at com.android.build.gradle.tasks.ProcessAndroidResources.doFullTaskAction(ProcessAndroidResources.java:285)

    at com.android.build.gradle.internal.tasks.IncrementalTask.taskAction(IncrementalTask.java:109)

    [18:50:5at sun.reflect.NativeMethodAccessorImpl.invoke0(Native Method)s/authentication.ts, line: 16

    at sun.reflect.NativeMethodAccessorImpl.invoke(NativeMethodAccessorImpl.java:62)

    at sun.reflect.DelegatingMethodAccessorImpl.invoke(DelegatingMethodAccessorImpl.java:43)

    L1at java.lang.reflect.Method.invoke(Method.java:498)

    L1at org.gradle.internal.reflect.JavaMethod.invoke(JavaMethod.java:73)

    at org.gradle.api.internal.project.taskfactory.DefaultTaskClassInfoStore$IncrementalTaskAction.doExecute(DefaultTaskClassInfoStore.java:173)/Nexcorp/Documents/ionic/wplms/src/services/activity.ts, line: 28

    at org.gradle.api.internal.project.taskfactory.DefaultTaskClassInfoStore$StandardTaskAction.execute(DefaultTaskClassInfoStore.java:134)

    L2at org.gradle.api.internal.project.taskfactory.DefaultTaskClassInfoStore$StandardTaskAction.execute(DefaultTaskClassInfoStore.java:121) observable: Observable<any>; //Tracks request in progress

    at org.gradle.api.internal.tasks.execution.ExecuteActionsTaskExecuter$1.run(ExecuteActionsTaskExecuter.java:122)

    [18:50:5at org.gradle.internal.progress.DefaultBuildOperationExecutor$RunnableBuildOperationWorker.execute(DefaultBuildOperationExecutor.java:336)form’ is declared but its value is never read.

    at org.gradle.internal.progress.DefaultBuildOperationExecutor$RunnableBuildOperationWorker.execute(DefaultBuildOperationExecutor.java:328)ttp,

    L3at org.gradle.internal.progress.DefaultBuildOperationExecutor.execute(DefaultBuildOperationExecutor.java:197)

    L3at org.gradle.internal.progress.DefaultBuildOperationExecutor.run(DefaultBuildOperationExecutor.java:107)

    at org.gradle.api.internal.tasks.execution.ExecuteActionsTaskExecuter.executeAction(ExecuteActionsTaskExecuter.java:111)4]  tslint: C:/Users/Nexcorp/Documents/ionic/wplms/src/services/activity.ts, line: 2

    at org.gradle.api.internal.tasks.execution.ExecuteActionsTaskExecuter.executeActions(ExecuteActionsTaskExecuter.java:92)

    Lat org.gradle.api.internal.tasks.execution.ExecuteActionsTaskExecuter.execute(ExecuteActionsTaskExecuter.java:70)      L2:  import { Http, Headers, Response, RequestOptions, URLSearchParams } from ‘@angular/http’;

    Lat org.gradle.api.internal.tasks.execution.SkipUpToDateTaskExecuter.execute(SkipUpToDateTaskExecuter.java:63)

    at org.gradle.api.internal.tasks.execution.ResolveTaskOutputCachingStateExecuter.execute(ResolveTaskOutputCachingStateExecuter.java:54)Users/Nexcorp/Documents/ionic/wplms/src/services/activity.ts, line: 8

    at org.gradle.api.internal.tasks.execution.ValidatingTaskExecuter.execute(ValidatingTaskExecuter.java:58)

    at org.gradle.api.internal.tasks.execution.SkipEmptySourceFilesTaskExecuter.execute(SkipEmptySourceFilesTaskExecuter.java:88)mport ‘rxjs/add/observable/of’;

    Lat org.gradle.api.internal.tasks.execution.ResolveTaskArtifactStateTaskExecuter.execute(ResolveTaskArtifactStateTaskExecuter.java:52)

    [18:50:5at org.gradle.api.internal.tasks.execution.SkipTaskWithNoActionsExecuter.execute(SkipTaskWithNoActionsExecuter.java:52)     All imports are unused.

    at org.gradle.api.internal.tasks.execution.SkipOnlyIfTaskExecuter.execute(SkipOnlyIfTaskExecuter.java:54)

    L1at org.gradle.api.internal.tasks.execution.ExecuteAtMostOnceTaskExecuter.execute(ExecuteAtMostOnceTaskExecuter.java:43)11:  import { ActivityMeta } from “../models/activity”;

    at org.gradle.api.internal.tasks.execution.CatchExceptionTaskExecuter.execute(CatchExceptionTaskExecuter.java:34)18:50:54]  tslint: C:/Users/Nexcorp/Documents/ionic/wplms/src/services/activity.ts, line: 16

    at org.gradle.execution.taskgraph.DefaultTaskGraphExecuter$EventFiringTaskWorker$1.run(DefaultTaskGraphExecuter.java:248)

    L1at org.gradle.internal.progress.DefaultBuildOperationExecutor$RunnableBuildOperationWorker.execute(DefaultBuildOperationExecutor.java:336)

    [18:50:5at org.gradle.internal.progress.DefaultBuildOperationExecutor$RunnableBuildOperationWorker.execute(DefaultBuildOperationExecutor.java:328)e unused.

    at org.gradle.internal.progress.DefaultBuildOperationExecutor.execute(DefaultBuildOperationExecutor.java:197)

    Lat org.gradle.internal.progress.DefaultBuildOperationExecutor.run(DefaultBuildOperationExecutor.java:107)

    Lat org.gradle.execution.taskgraph.DefaultTaskGraphExecuter$EventFiringTaskWorker.execute(DefaultTaskGraphExecuter.java:241) import ‘rxjs/add/operator/map’;

    at org.gradle.execution.taskgraph.DefaultTaskGraphExecuter$EventFiringTaskWorker.execute(DefaultTaskGraphExecuter.java:230) tslint: C:/Users/Nexcorp/Documents/ionic/wplms/src/services/users.ts, line: 6

    at org.gradle.execution.taskgraph.DefaultTaskPlanExecutor$TaskExecutorWorker.processTask(DefaultTaskPlanExecutor.java:124)

    Lat org.gradle.execution.taskgraph.DefaultTaskPlanExecutor$TaskExecutorWorker.access$200(DefaultTaskPlanExecutor.java:80)6:  import { CacheService } from “ionic-cache”;

    Lat org.gradle.execution.taskgraph.DefaultTaskPlanExecutor$TaskExecutorWorker$1.execute(DefaultTaskPlanExecutor.java:105)

    [18:50:5at org.gradle.execution.taskgraph.DefaultTaskPlanExecutor$TaskExecutorWorker$1.execute(DefaultTaskPlanExecutor.java:99)     All imports are unused.

    at org.gradle.execution.taskgraph.DefaultTaskExecutionPlan.execute(DefaultTaskExecutionPlan.java:625)

    L1at org.gradle.execution.taskgraph.DefaultTaskExecutionPlan.executeWithTask(DefaultTaskExecutionPlan.java:580)

    L1at org.gradle.execution.taskgraph.DefaultTaskPlanExecutor$TaskExecutorWorker.run(DefaultTaskPlanExecutor.java:99)

    [18:50:5at org.gradle.internal.concurrent.ExecutorPolicy$CatchAndRecordFailures.onExecute(ExecutorPolicy.java:63)

    at org.gradle.internal.concurrent.ManagedExecutorImpl$1.run(ManagedExecutorImpl.java:46)

    at java.util.concurrent.ThreadPoolExecutor.runWorker(ThreadPoolExecutor.java:1149)

    L3at java.util.concurrent.ThreadPoolExecutor$Worker.run(ThreadPoolExecutor.java:624)

    L3at org.gradle.internal.concurrent.ThreadFactoryImpl$ManagedThreadRunnable.run(ThreadFactoryImpl.java:55)

    at java.lang.Thread.run(Thread.java:748)

    Caused by: java.util.concurrent.ExecutionException: java.util.concurrent.ExecutionException: com.android.tools.aapt2.Aapt2Exception: AAPT2 error: check logs for detailslue is never read.

    at com.google.common.util.concurrent.AbstractFuture.getDoneValue(AbstractFuture.java:503)

    L6at com.google.common.util.concurrent.AbstractFuture.get(AbstractFuture.java:482)

    L6at com.google.common.util.concurrent.AbstractFuture$TrustedFuture.get(AbstractFuture.java:79)

    at com.android.builder.core.AndroidBuilder.processResources(AndroidBuilder.java:794)

    [18:50:5… 48 more C:/Users/Nexcorp/Documents/ionic/wplms/src/services/course.ts, line: 74

    Caused by: java.util.concurrent.ExecutionException: com.android.tools.aapt2.Aapt2Exception: AAPT2 error: check logs for details

    L7at com.google.common.util.concurrent.AbstractFuture.getDoneValue(AbstractFuture.java:503)

    L7at com.google.common.util.concurrent.AbstractFuture.get(AbstractFuture.java:462)

    at com.google.common.util.concurrent.AbstractFuture$TrustedFuture.get(AbstractFuture.java:79)

    [18:50:5at com.android.builder.internal.aapt.v2.QueueableAapt2.lambda$makeValidatedPackage$1(QueueableAapt2.java:179)

    at java.util.concurrent.ThreadPoolExecutor.runWorker(ThreadPoolExecutor.java:1149)

    at java.util.concurrent.ThreadPoolExecutor$Worker.run(ThreadPoolExecutor.java:624)

    L9… 1 more      let count:number=0;

    Caused by: com.android.tools.aapt2.Aapt2Exception: AAPT2 error: check logs for detailsgth;

    at com.android.builder.png.AaptProcess$NotifierProcessOutput.handleOutput(AaptProcess.java:454)

    [18:50:5at com.android.builder.png.AaptProcess$NotifierProcessOutput.err(AaptProcess.java:411)

    at com.android.builder.png.AaptProcess$ProcessOutputFacade.err(AaptProcess.java:332)

    at com.android.utils.GrabProcessOutput$1.run(GrabProcessOutput.java:104)

    L164:  let body = response.json();

    FAILURE: Build failed with an exception.

    L166:  this.catobservable = null;

    * What went wrong:

    Execution failed for task ‘:app:processReleaseResources’.s/src/services/course.ts, line: 201

    > Failed to execute aaptlared but its value is never read.

     

    * Try:200:  let body = response.json();

    Run with –stacktrace option to get the stack trace. Run with –info or –debug option to get more log output.

    L202:  this.locobservable = null;

    * Get more help at https://help.gradle.org

    [18:50:54]  tslint: C:/Users/Nexcorp/Documents/ionic/wplms/src/services/course.ts, line: 239

    BUILD FAILED in 12ss declared but its value is never read.

    Picked up _JAVA_OPTIONS: -Xmx512M

    at ChildProcess.whenDone (C:\Users\Nexcorp\Documents\ionic\wplms\platforms\android\cordova\node_modules\cordova-common\src\superspawn.js:169:23)

    at emitTwo (events.js:126:13)null;

    at ChildProcess.emit (events.js:214:7)

    at maybeClose (internal/child_process.js:925:16)/wplms/src/services/course.ts, line: 300

    at Process.ChildProcess._handle.onexit (internal/child_process.js:209:5)

    (node:1368) UnhandledPromiseRejectionWarning: Unhandled promise rejection. This error originated either by throwing inside of an async function without a catch block, or by rejecting a promise which was not handled with .catch(). (rejection id: 1)00:      let k = 0;

    (node:1368) [DEP0018] DeprecationWarning: Unhandled promise rejections are deprecated. In the future, promise rejections that are not handled will terminate the Node.js process with a non-zero exit code.

     

    ‘k’ is declared but its value is never read.

    C:\Users\Nexcorp\Documents\ionic\wplms>

    L301:  if(this.fullCourses){

    L302:      let k = this.fullCourses.length;

     

    [18:50:54]  tslint: C:/Users/Nexcorp/Documents/ionic/wplms/src/services/course.ts, line: 561

    ‘getIndexByKeyValue’ is declared but its value is never read.

     

    L561:      private getIndexByKeyValue(arraytosearch, key, valuetosearch) {

     

    [18:50:54]  tslint: C:/Users/Nexcorp/Documents/ionic/wplms/src/services/course.ts, line: 571

    ‘copyobject’ is declared but its value is never read.

     

    L571:      private  copyobject(srcObj:any, destObj:any) {

    L572:          for (var key in destObj) {

     

    [18:50:54]  tslint: C:/Users/Nexcorp/Documents/ionic/wplms/src/services/course.ts, line: 1

    ‘OnInit’ is declared but its value is never read.

     

    L1:  import { Injectable, OnInit } from ‘@angular/core’;

    L2:  import { Http, Headers, Response, RequestOptions, URLSearchParams } from ‘@angular/http’;

     

    [18:50:54]  tslint: C:/Users/Nexcorp/Documents/ionic/wplms/src/services/course.ts, line: 2

    ‘Http’ is declared but its value is never read.

     

    L1:  import { Injectable, OnInit } from ‘@angular/core’;

    L2:  import { Http, Headers, Response, RequestOptions, URLSearchParams } from ‘@angular/http’;

     

    [18:50:54]  tslint: C:/Users/Nexcorp/Documents/ionic/wplms/src/services/course.ts, line: 2

    ‘Headers’ is declared but its value is never read.

     

    L1:  import { Injectable, OnInit } from ‘@angular/core’;

    L2:  import { Http, Headers, Response, RequestOptions, URLSearchParams } from ‘@angular/http’;

     

    [18:50:54]  tslint: C:/Users/Nexcorp/Documents/ionic/wplms/src/services/course.ts, line: 2

    ‘Response’ is declared but its value is never read.

     

    L1:  import { Injectable, OnInit } from ‘@angular/core’;

    L2:  import { Http, Headers, Response, RequestOptions, URLSearchParams } from ‘@angular/http’;

     

    [18:50:54]  tslint: C:/Users/Nexcorp/Documents/ionic/wplms/src/services/course.ts, line: 2

    ‘RequestOptions’ is declared but its value is never read.

     

    L1:  import { Injectable, OnInit } from ‘@angular/core’;

    L2:  import { Http, Headers, Response, RequestOptions, URLSearchParams } from ‘@angular/http’;

     

    [18:50:54]  tslint: C:/Users/Nexcorp/Documents/ionic/wplms/src/services/course.ts, line: 10

    All imports are unused.

     

    L10:  import { Storage } from ‘@ionic/storage’;

     

    [18:50:54]  tslint: C:/Users/Nexcorp/Documents/ionic/wplms/src/services/blog.ts, line: 2

    All imports are unused.

     

    L1:  import { Injectable } from ‘@angular/core’;

    L2:  import { Http, Headers, Response, RequestOptions, URLSearchParams } from ‘@angular/http’;

    L3:  import { Storage } from ‘@ionic/storage’;

     

    [18:50:54]  tslint: C:/Users/Nexcorp/Documents/ionic/wplms/src/services/blog.ts, line: 3

    All imports are unused.

     

    L2:  import { Http, Headers, Response, RequestOptions, URLSearchParams } from ‘@angular/http’;

    L3:  import { Storage } from ‘@ionic/storage’;

    L4:  import { ConfigService } from “./config”;

     

    [18:50:54]  tslint: C:/Users/Nexcorp/Documents/ionic/wplms/src/pages/search/search.ts, line: 33

    Property ‘config’ is declared but its value is never read.

     

    L32:  private userService:UserService,

    L33:  private config:ConfigService

    L34:  ){

     

    [18:50:54]  tslint: C:/Users/Nexcorp/Documents/ionic/wplms/src/pages/search/search.ts, line: 9

    All imports are unused.

     

    L9:  import { Course } from ‘../../models/course’;

     

    [18:50:54]  tslint: C:/Users/Nexcorp/Documents/ionic/wplms/src/services/wallet.ts, line: 2

    All imports are unused.

     

    L1:  import { Injectable} from ‘@angular/core’;

    L2:  import { Http, Headers, Response, RequestOptions, URLSearchParams } from ‘@angular/http’;

     

    [18:50:54]  tslint: C:/Users/Nexcorp/Documents/ionic/wplms/src/services/wallet.ts, line: 6

    All imports are unused.

     

    L6:  import { Storage } from ‘@ionic/storage’;

    L7:  import { ConfigService } from “./config”;

     

    [18:50:54]  tslint: C:/Users/Nexcorp/Documents/ionic/wplms/src/pipes/orderby.ts, line: 1

    ‘PipeTransform’ is declared but its value is never read.

     

    L1:  import { Pipe, PipeTransform } from ‘@angular/core’;

    L2:  import {SafeResourceUrl, DomSanitizer} from ‘@angular/platform-browser’;

     

    [18:50:54]  tslint: C:/Users/Nexcorp/Documents/ionic/wplms/src/pipes/orderby.ts, line: 2

    All imports are unused.

     

    L1:  import { Pipe, PipeTransform } from ‘@angular/core’;

    L2:  import {SafeResourceUrl, DomSanitizer} from ‘@angular/platform-browser’;

     

    [18:50:54]  tslint: C:/Users/Nexcorp/Documents/ionic/wplms/src/pages/course/course.ts, line: 201

    ‘matches’ is declared but its value is never read.

     

    L200:  if(event.url.indexOf(‘?key=wc_order_’) !== -1){

    L201:    let matches = event.url.match(‘.+/([0-9]+)/.+’);

    L202:    this.browser.close();

     

    [18:50:54]  tslint: C:/Users/Nexcorp/Documents/ionic/wplms/src/pages/course/course.ts, line: 417

    ‘matches’ is declared but its value is never read.

     

    L416:  if(pricing.source == ‘woocommerce’ && event.url.indexOf(‘?key=wc_order_’) !== -1){

    L417:    let matches = event.url.match(‘.+/([0-9]+)/.+’);

    L418:    this.browser.close();

     

    [18:50:54]  tslint: C:/Users/Nexcorp/Documents/ionic/wplms/src/pages/course/course.ts, line: 1

    ‘OnInit’ is declared but its value is never read.

     

    L1:  import { Component, OnInit, ViewChild } from ‘@angular/core’;

    L2:  import { NavController, NavParams, ModalController,ToastController,LoadingController,AlertController, Platform, Slides } from ‘ionic-angular’;

     

    [18:50:54]  tslint: C:/Users/Nexcorp/Documents/ionic/wplms/src/pages/course/course.ts, line: 14

    All imports are unused.

     

    L14:  import { Storage } from ‘@ionic/storage’;

    L15:  import { ConfigService } from ‘../../services/config’;

     

    [18:50:54]  tslint: C:/Users/Nexcorp/Documents/ionic/wplms/src/pages/course/course.ts, line: 21

    All imports are unused.

     

    L21:  import { LazyImgComponent }   from ‘../components/lazy-img/lazy-img’;

    L22:  import { LazyLoadDirective }   from ‘../directives/lazy-load.directive’;

     

    [18:50:54]  tslint: C:/Users/Nexcorp/Documents/ionic/wplms/src/pages/course/course.ts, line: 22

    All imports are unused.

     

    L21:  import { LazyImgComponent }   from ‘../components/lazy-img/lazy-img’;

    L22:  import { LazyLoadDirective }   from ‘../directives/lazy-load.directive’;

    L23:  import { ImgcacheService } from “../services/imageCache”;

     

    [18:50:54]  tslint: C:/Users/Nexcorp/Documents/ionic/wplms/src/pages/course/course.ts, line: 23

    All imports are unused.

     

    L22:  import { LazyLoadDirective }   from ‘../directives/lazy-load.directive’;

    L23:  import { ImgcacheService } from “../services/imageCache”;

     

    [18:50:54]  tslint: C:/Users/Nexcorp/Documents/ionic/wplms/src/pages/course/course.ts, line: 25

    All imports are unused.

     

    L25:  import { SafeHtmlPipe } from “../../pipes/orderby”;

     

    [18:50:54]  tslint: C:/Users/Nexcorp/Documents/ionic/wplms/src/pages/reviewcourse/reviewcourse.ts, line: 25

    Property ‘navCtrl’ is declared but its value is never read.

     

    L24:  private viewCtrl: ViewController,

    L25:  private navCtrl: NavController,

    L26:  private navParams: NavParams,

     

    [18:50:54]  tslint: C:/Users/Nexcorp/Documents/ionic/wplms/src/pages/reviewcourse/reviewcourse.ts, line: 28

    Property ‘config’ is declared but its value is never read.

     

    L27:  private userService: UserService,

    L28:  private config:ConfigService,

    L29:  private loadingCtrl:LoadingController){

     

    [18:50:54]  tslint: C:/Users/Nexcorp/Documents/ionic/wplms/src/pages/reviewcourse/reviewcourse.ts, line: 1

    ‘OnInit’ is declared but its value is never read.

     

     

    UP-TO-DATE

    :app:compileReleaseAidl

    L1:  import { Component, OnInit } from ‘@angular/core’;

    L2:  import { FormGroup,FormControl, Validators } from ‘@angular/forms’;

     

    [18:50:54]  tslint: …/Users/Nexcorp/Documents/ionic/wplms/src/components/friendlytime/friendlytime.ts, line: 1

    ‘OnInit’ is declared but its value is never read.

     

    L1:  import { Component, OnInit, Input , Output, EventEmitter } from ‘@angular/core’;

    L2:  import { ConfigService } from ‘../../services/config’;

     

    [18:50:54]  tslint: …/Users/Nexcorp/Documents/ionic/wplms/src/components/friendlytime/friendlytime.ts, line: 1

    ‘Output’ is declared but its value is never read.

     

    L1:  import { Component, OnInit, Input , Output, EventEmitter } from ‘@angular/core’;

    L2:  import { ConfigService } from ‘../../services/config’;

     

    [18:50:54]  tslint: …/Users/Nexcorp/Documents/ionic/wplms/src/components/friendlytime/friendlytime.ts, line: 1

    ‘EventEmitter’ is declared but its value is never read.

     

    UP-TO-DATE

     

    :CordovaLib:packageReleaseRenderscript NO-SOURCE

    L1:  import { Component, OnInit, Input , Output, EventEmitter } from ‘@angular/core’;

    L2:  import { ConfigService } from ‘../../services/config’;

     

    [18:50:54]  tslint: C:/Users/Nexcorp/Documents/ionic/wplms/src/components/question/question.ts, line: 273

    Duplicate variable: ‘correct’

     

    L272:  if(this.question.marked){

    :app:compileReleaseRenderscript

    L273:      var correct = this.question.marked.split(‘,’);;

    L274:      if(correct.length){

     

    [18:50:54]  tslint: C:/Users/Nexcorp/Documents/ionic/wplms/src/components/question/question.ts, line: 287

    Duplicate variable: ‘correct’

     

    L286:  if(this.question.marked){

    L287:      var correct = this.question.marked.split(‘,’);;

    L288:      if(correct.length){

     

    [18:50:54]  tslint: C:/Users/Nexcorp/Documents/ionic/wplms/src/components/question/question.ts, line: 330

    Duplicate variable: ‘correct’

     

    L330:   var correct = this.question.correct.split(‘|’);

    L331:   if(correct.length){

     

    UP-TO-DATE

    [18:50:54]  tslint: C:/Users/Nexcorp/Documents/ionic/wplms/src/components/question/question.ts, line: 342

    :app:checkReleaseManifest UP-TO-DATE

    :app:generateReleaseBuildConfig UP-TO-DATE

    :app:prepareLintJar UP-TO-DATE

    Duplicate variable: ‘correct’

     

    L341:  answer = ”;

    L342:  var correct = this.question.correct.split(‘|’);

    L343:  if(correct.length){

     

    [18:50:54]  tslint: C:/Users/Nexcorp/Documents/ionic/wplms/src/components/question/question.ts, line: 1

    ‘OnInit’ is declared but its value is never read.

     

    L1:  import { Component, Input, OnInit, Output, EventEmitter } from ‘@angular/core’;

     

    :app:generateReleaseResValues

    [18:50:54]  tslint: C:/Users/Nexcorp/Documents/ionic/wplms/src/components/question/question.ts, line: 3

    UP-TO-DATE

    :app:generateReleaseResources UP-TO-DATE

    :app:mergeReleaseResources

    ‘DragulaModule’ is declared but its value is never read.

     

    L3:  import { DragulaModule,DragulaService } from ‘../../../node_modules/ng2-dragula/ng2-dragula’;

     

    [18:50:54]  tslint: C:/Users/Nexcorp/Documents/ionic/wplms/src/services/quiz.ts, line: 23

    ‘observable’ is declared but its value is never read.

     

    L23:      private observable: Observable<any>;

     

    [18:50:54]  tslint: C:/Users/Nexcorp/Documents/ionic/wplms/src/services/quiz.ts, line: 25

    Property ‘http’ is declared but its value is never read.

     

    L25:      constructor(private http:Http,

    L26:          private userService: UserService,

     

    [18:50:54]  tslint: C:/Users/Nexcorp/Documents/ionic/wplms/src/services/quiz.ts, line: 28

    Property ‘config’ is declared but its value is never read.

     

    L27:  private storage: Storage,

    L28:  private config:ConfigService) {

     

    [18:50:54]  tslint: C:/Users/Nexcorp/Documents/ionic/wplms/src/services/quiz.ts, line: 1

    ‘OnInit’ is declared but its value is never read.

     

    L1:  import { Injectable, OnInit } from ‘@angular/core’;

    L2:  import { Http, Headers, Response, RequestOptions, URLSearchParams } from ‘@angular/http’;

     

    [18:50:54]  tslint: C:/Users/Nexcorp/Documents/ionic/wplms/src/services/quiz.ts, line: 2

    All imports are unused.

     

    L1:  import { Injectable, OnInit } from ‘@angular/core’;

    L2:  import { Http, Headers, Response, RequestOptions, URLSearchParams } from ‘@angular/http’;

    L3:  import ‘rxjs/add/operator/map’;

     

    [18:50:54]  tslint: C:/Users/Nexcorp/Documents/ionic/wplms/src/services/quiz.ts, line: 6

    All imports are unused.

     

    L5:  import ‘rxjs/add/observable/of’;

    L6:  import { CacheService } from “ionic-cache”;

     

    [18:50:54]  tslint: C:/Users/Nexcorp/Documents/ionic/wplms/src/services/quiz.ts, line: 11

    All imports are unused.

     

    L11:  import { Storage } from ‘@ionic/storage’;

     

    [18:50:54]  tslint: C:/Users/Nexcorp/Documents/ionic/wplms/src/components/timer/timer.ts, line: 26

    Property ‘config’ is declared but its value is never read.

     

    L26:    constructor(private quizService:QuizService,private config:ConfigService) {

     

    [18:50:54]  tslint: C:/Users/Nexcorp/Documents/ionic/wplms/src/components/timer/timer.ts, line: 1

    ‘OnInit’ is declared but its value is never read.

     

    L1:  import { Component, Input, OnInit, Output, EventEmitter, OnChanges } from ‘@angular/core’;

    L2:  import {Observable} from ‘rxjs/Rx’;

     

    [18:50:54]  tslint: C:/Users/Nexcorp/Documents/ionic/wplms/src/components/timer/timer.ts, line: 1

    ‘OnChanges’ is declared but its value is never read.

     

    L1:  import { Component, Input, OnInit, Output, EventEmitter, OnChanges } from ‘@angular/core’;

    L2:  import {Observable} from ‘rxjs/Rx’;

     

    [18:50:54]  tslint: C:/Users/Nexcorp/Documents/ionic/wplms/src/models/status.ts, line: 1

    All imports are unused.

     

    L1:  import { Course } from ‘./course’;

    L2:  import { User } from ‘./user’;

     

    [18:50:54]  tslint: C:/Users/Nexcorp/Documents/ionic/wplms/src/models/status.ts, line: 2

    All imports are unused.

     

    L1:  import { Course } from ‘./course’;

    L2:  import { User } from ‘./user’;

     

    [18:50:54]  tslint: C:/Users/Nexcorp/Documents/ionic/wplms/src/services/status.ts, line: 29

    ‘quizobservable’ is declared but its value is never read.

     

    L28:  private statusobservable: Observable<any>;

    L29:  private quizobservable: Observable<any>;

    L30:  private retakeobservable: Observable<any>;

     

    [18:50:54]  tslint: C:/Users/Nexcorp/Documents/ionic/wplms/src/services/status.ts, line: 76

    ‘cacheKey’ is declared but its value is never read.

     

    L75:              let url = ${this.baseUrl}user/coursestatus/+status.course_id;

    L76:              let cacheKey = url;

     

    [18:50:54]  tslint: C:/Users/Nexcorp/Documents/ionic/wplms/src/services/status.ts, line: 84

    ‘k’ is declared but its value is never read.

     

    L84:                  let k = this.courseStatuses.length;

     

    [18:50:54]  tslint: C:/Users/Nexcorp/Documents/ionic/wplms/src/services/status.ts, line: 169

    ‘k’ is declared but its value is never read.

     

    L169:                  let k = this.courseStatuses.length;

     

    [18:50:54]  tslint: C:/Users/Nexcorp/Documents/ionic/wplms/src/services/status.ts, line: 1

    ‘OnInit’ is declared but its value is never read.

     

    L1:  import { Injectable,OnInit } from ‘@angular/core’;

    L2:  import { Http, Headers, Response, RequestOptions, URLSearchParams } from ‘@angular/http’;

     

    [18:50:54]  tslint: C:/Users/Nexcorp/Documents/ionic/wplms/src/services/status.ts, line: 2

    All imports are unused.

     

    L1:  import { Injectable,OnInit } from ‘@angular/core’;

    L2:  import { Http, Headers, Response, RequestOptions, URLSearchParams } from ‘@angular/http’;

     

    [18:50:54]  tslint: C:/Users/Nexcorp/Documents/ionic/wplms/src/services/status.ts, line: 10

    All imports are unused.

     

    L10:  import { Course } from “../models/course”;

    L11:  import { CourseStatus } from “../models/status”;

     

    [18:50:54]  tslint: C:/Users/Nexcorp/Documents/ionic/wplms/src/services/status.ts, line: 17

    All imports are unused.

     

    L16:  import { ActivityService } from “./activity”;

    L17:  import { Storage } from ‘@ionic/storage’;

     

    [18:50:54]  tslint: …sers/Nexcorp/Documents/ionic/wplms/src/components/absolute-drag/absolute-drag.ts, line: 1

    ‘ElementRef’ is declared but its value is never read.

     

    L1:  import { Directive, Input, ElementRef, Renderer } from ‘@angular/core’;

    L2:  import { DomController } from ‘ionic-angular’;

     

    [18:50:54]  tslint: …sers/Nexcorp/Documents/ionic/wplms/src/components/absolute-drag/absolute-drag.ts, line: 1

    ‘Renderer’ is declared but its value is never read.

     

    L1:  import { Directive, Input, ElementRef, Renderer } from ‘@angular/core’;

    L2:  import { DomController } from ‘ionic-angular’;

     

    [18:50:54]  tslint: C:/Users/Nexcorp/Documents/ionic/wplms/src/directives/pinch-zoom.directive.ts, line: 1

    ‘ElementRef’ is declared but its value is never read.

     

    L1:  import { Directive, ElementRef, Input, OnInit, OnDestroy, Renderer } from ‘@angular/core’;

    L2:  import { Gesture } from ‘ionic-angular/gestures/gesture’;

     

    [18:50:54]  tslint: C:/Users/Nexcorp/Documents/ionic/wplms/src/directives/pinch-zoom.directive.ts, line: 1

    ‘Input’ is declared but its value is never read.

     

    L1:  import { Directive, ElementRef, Input, OnInit, OnDestroy, Renderer } from ‘@angular/core’;

    L2:  import { Gesture } from ‘ionic-angular/gestures/gesture’;

     

    [18:50:54]  tslint: C:/Users/Nexcorp/Documents/ionic/wplms/src/directives/pinch-zoom.directive.ts, line: 1

    ‘OnInit’ is declared but its value is never read.

     

    L1:  import { Directive, ElementRef, Input, OnInit, OnDestroy, Renderer } from ‘@angular/core’;

    L2:  import { Gesture } from ‘ionic-angular/gestures/gesture’;

     

    [18:50:54]  tslint: C:/Users/Nexcorp/Documents/ionic/wplms/src/directives/pinch-zoom.directive.ts, line: 1

    ‘OnDestroy’ is declared but its value is never read.

     

    L1:  import { Directive, ElementRef, Input, OnInit, OnDestroy, Renderer } from ‘@angular/core’;

    L2:  import { Gesture } from ‘ionic-angular/gestures/gesture’;

     

    [18:50:54]  tslint: C:/Users/Nexcorp/Documents/ionic/wplms/src/directives/pinch-zoom.directive.ts, line: 1

    ‘Renderer’ is declared but its value is never read.

     

    L1:  import { Directive, ElementRef, Input, OnInit, OnDestroy, Renderer } from ‘@angular/core’;

    L2:  import { Gesture } from ‘ionic-angular/gestures/gesture’;

     

    [18:50:54]  tslint: C:/Users/Nexcorp/Documents/ionic/wplms/src/pages/course-status/course-status.ts, line: 395

    ‘index’ is declared but its value is never read.

     

    L394:  onQuestionSlide(){

    L395:      let index = this.courseStatusItems.getActiveIndex();

     

    [18:50:54]  tslint: C:/Users/Nexcorp/Documents/ionic/wplms/src/pages/course-status/course-status.ts, line: 1

    ‘OnInit’ is declared but its value is never read.

     

    L1:  import { Component, OnInit, ViewChild, Output, EventEmitter } from ‘@angular/core’;

    L2:  import { NavController, NavParams, ModalController,LoadingController, AlertController,Platform, Slides,ToastController } from ‘ionic-angular’;

     

    [18:50:54]  tslint: C:/Users/Nexcorp/Documents/ionic/wplms/src/pages/course-status/course-status.ts, line: 1

    ‘Output’ is declared but its value is never read.

     

    L1:  import { Component, OnInit, ViewChild, Output, EventEmitter } from ‘@angular/core’;

    L2:  import { NavController, NavParams, ModalController,LoadingController, AlertController,Platform, Slides,ToastController } from ‘ionic-angular’;

     

    [18:50:54]  tslint: C:/Users/Nexcorp/Documents/ionic/wplms/src/pages/course-status/course-status.ts, line: 1

    ‘EventEmitter’ is declared but its value is never read.

     

    L1:  import { Component, OnInit, ViewChild, Output, EventEmitter } from ‘@angular/core’;

    L2:  import { NavController, NavParams, ModalController,LoadingController, AlertController,Platform, Slides,ToastController } from ‘ionic-angular’;

     

    [18:50:54]  tslint: C:/Users/Nexcorp/Documents/ionic/wplms/src/pages/course-status/course-status.ts, line: 2

    ‘Platform’ is declared but its value is never read.

     

    L1:  import { Component, OnInit, ViewChild, Output, EventEmitter } from ‘@angular/core’;

    L2:  arams, ModalController,LoadingController, AlertController,Platform, Slides,ToastController } from ‘ionic-ang

    L3:  import {SafeResourceUrl, DomSanitizer} from ‘@angular/platform-browser’;

     

    [18:50:54]  tslint: C:/Users/Nexcorp/Documents/ionic/wplms/src/pages/course-status/course-status.ts, line: 3

    All imports are unused.

     

    L2:  import { NavController, NavParams, ModalController,LoadingController, AlertController,Platform, Slides,ToastController } from ‘ionic-angular’;

    L3:  import {SafeResourceUrl, DomSanitizer} from ‘@angular/platform-browser’;

    L4:  import { InAppBrowser } from ‘@ionic-native/in-app-browser’;

     

    [18:50:54]  tslint: C:/Users/Nexcorp/Documents/ionic/wplms/src/pages/course-status/course-status.ts, line: 11

    All imports are unused.

     

    L11:  import { FriendlytimeComponent } from ‘../../components/friendlytime/friendlytime’;

    L12:  import { QuestionComponent } from ‘../../components/question/question’;

     

    [18:50:54]  tslint: C:/Users/Nexcorp/Documents/ionic/wplms/src/pages/course-status/course-status.ts, line: 12

    All imports are unused.

     

    L11:  import { FriendlytimeComponent } from ‘../../components/friendlytime/friendlytime’;

    L12:  import { QuestionComponent } from ‘../../components/question/question’;

    L13:  import { TimerComponent } from ‘../../components/timer/timer’;

     

    [18:50:54]  tslint: C:/Users/Nexcorp/Documents/ionic/wplms/src/pages/course-status/course-status.ts, line: 13

    All imports are unused.

     

    L12:  import { QuestionComponent } from ‘../../components/question/question’;

    L13:  import { TimerComponent } from ‘../../components/timer/timer’;

     

    [18:50:54]  tslint: C:/Users/Nexcorp/Documents/ionic/wplms/src/pages/course-status/course-status.ts, line: 15

    All imports are unused.

     

    L15:  import { Course } from ‘../../models/course’;

    L16:  import { Activity } from ‘../../models/activity’;

     

    [18:50:54]  tslint: C:/Users/Nexcorp/Documents/ionic/wplms/src/pages/course-status/course-status.ts, line: 16

    All imports are unused.

     

    L15:  import { Course } from ‘../../models/course’;

    L16:  import { Activity } from ‘../../models/activity’;

    L17:  import { ActivityMeta } from ‘../../models/activity’;

     

    [18:50:54]  tslint: C:/Users/Nexcorp/Documents/ionic/wplms/src/pages/course-status/course-status.ts, line: 17

    All imports are unused.

     

    L16:  import { Activity } from ‘../../models/activity’;

    L17:  import { ActivityMeta } from ‘../../models/activity’;

    L18:  import { User } from ‘../../models/user’;

     

    [18:50:54]  tslint: C:/Users/Nexcorp/Documents/ionic/wplms/src/pages/course-status/course-status.ts, line: 18

    All imports are unused.

     

    L17:  import { ActivityMeta } from ‘../../models/activity’;

    L18:  import { User } from ‘../../models/user’;

    L19:  import { CourseStatus } from ‘../../models/status’;

     

    [18:50:54]  tslint: C:/Users/Nexcorp/Documents/ionic/wplms/src/pages/course-status/course-status.ts, line: 29

    All imports are unused.

     

    L29:  import { Storage } from ‘@ionic/storage’;

     

    [18:50:54]  tslint: C:/Users/Nexcorp/Documents/ionic/wplms/src/pages/course-status/course-status.ts, line: 31

    All imports are unused.

     

    L31:  import {AbsoluteDrag} from ‘../../components/absolute-drag/absolute-drag’;

    L32:  import {PinchZoomDirective} from ‘../../directives/pinch-zoom.directive’;

     

    [18:50:54]  tslint: C:/Users/Nexcorp/Documents/ionic/wplms/src/pages/course-status/course-status.ts, line: 32

    All imports are unused.

     

    L31:  import {AbsoluteDrag} from ‘../../components/absolute-drag/absolute-drag’;

    L32:  import {PinchZoomDirective} from ‘../../directives/pinch-zoom.directive’;

     

    [18:50:54]  tslint: C:/Users/Nexcorp/Documents/ionic/wplms/src/pages/course-status/course-status.ts, line: 36

    All imports are unused.

     

    L36:  import { SafeHtmlPipe } from “../../pipes/orderby”;

    L37:  import { SafePipe } from “../../pipes/orderby”;

     

    [18:50:54]  tslint: C:/Users/Nexcorp/Documents/ionic/wplms/src/pages/course-status/course-status.ts, line: 37

    All imports are unused.

     

    L36:  import { SafeHtmlPipe } from “../../pipes/orderby”;

    L37:  import { SafePipe } from “../../pipes/orderby”;

     

    [18:50:54]  tslint: C:/Users/Nexcorp/Documents/ionic/wplms/src/pages/result/result.ts, line: 1

    ‘OnInit’ is declared but its value is never read.

     

    L1:  import { Component, OnInit } from ‘@angular/core’;

    L2:  import { IonicPage, NavController, NavParams, LoadingController } from ‘ionic-angular’;

     

    [18:50:54]  tslint: C:/Users/Nexcorp/Documents/ionic/wplms/src/pages/result/result.ts, line: 2

    ‘IonicPage’ is declared but its value is never read.

     

    L1:  import { Component, OnInit } from ‘@angular/core’;

    L2:  import { IonicPage, NavController, NavParams, LoadingController } from ‘ionic-angular’;

     

    [18:50:54]  tslint: C:/Users/Nexcorp/Documents/ionic/wplms/src/directives/longPress.directive.ts, line: 1

    ‘ElementRef’ is declared but its value is never read.

     

    L1:  import {Directive, ElementRef, OnInit, OnDestroy, Output, EventEmitter} from ‘@angular/core’;

    L2:  import {Gesture} from ‘ionic-angular/gestures/gesture’;

     

    [18:50:54]  tslint: C:/Users/Nexcorp/Documents/ionic/wplms/src/directives/longPress.directive.ts, line: 1

    ‘OnInit’ is declared but its value is never read.

     

    L1:  import {Directive, ElementRef, OnInit, OnDestroy, Output, EventEmitter} from ‘@angular/core’;

    L2:  import {Gesture} from ‘ionic-angular/gestures/gesture’;

     

    [18:50:54]  tslint: C:/Users/Nexcorp/Documents/ionic/wplms/src/directives/longPress.directive.ts, line: 1

    ‘OnDestroy’ is declared but its value is never read.

     

    L1:  import {Directive, ElementRef, OnInit, OnDestroy, Output, EventEmitter} from ‘@angular/core’;

    L2:  import {Gesture} from ‘ionic-angular/gestures/gesture’;

     

    [18:50:54]  tslint: C:/Users/Nexcorp/Documents/ionic/wplms/src/pages/profile/profile.ts, line: 86

    Property ‘formBuilder’ is declared but its value is never read.

     

    L85:  private storage:Storage,

    L86:  private formBuilder:FormBuilder,

    L87:  private loadingCtrl:LoadingController,

     

    [18:50:54]  tslint: C:/Users/Nexcorp/Documents/ionic/wplms/src/pages/profile/profile.ts, line: 1

    ‘OnInit’ is declared but its value is never read.

     

    L1:  import { Component, OnInit, ViewChild } from ‘@angular/core’;

    L2:  import { NavController,ViewController,LoadingController, ToastController,ActionSheetController,AlertController, NavParams, Slides,Platform } from ‘ionic-angular’;

     

    [18:50:54]  tslint: C:/Users/Nexcorp/Documents/ionic/wplms/src/pages/profile/profile.ts, line: 3

    ‘FormBuilder’ is declared but its value is never read.

     

    L2:  import { NavController,ViewController,LoadingController, ToastController,ActionSheetController,AlertController, NavParams, Slides,Platform } from ‘ionic-angular’;

    L3:  import { FormBuilder, FormGroup,FormControl, Validators, } from ‘@angular/forms’;

     

    [18:50:54]  tslint: C:/Users/Nexcorp/Documents/ionic/wplms/src/pages/profile/profile.ts, line: 3

    ‘FormGroup’ is declared but its value is never read.

     

    L2:  import { NavController,ViewController,LoadingController, ToastController,ActionSheetController,AlertController, NavParams, Slides,Platform } from ‘ionic-angular’;

    L3:  import { FormBuilder, FormGroup,FormControl, Validators, } from ‘@angular/forms’;

     

    [18:50:54]  tslint: C:/Users/Nexcorp/Documents/ionic/wplms/src/pages/profile/profile.ts, line: 3

     

    ‘FormControl’ is declared but its value is never read.

    UP-TO-DATE

    :app:createReleaseCompatibleScreenManifests

     

    L2:  import { NavController,ViewController,LoadingController, ToastController,ActionSheetController,AlertController, NavParams, Slides,Platform } from ‘ionic-angular’;

    L3:  import { FormBuilder, FormGroup,FormControl, Validators, } from ‘@angular/forms’;

     

    [18:50:54]  tslint: C:/Users/Nexcorp/Documents/ionic/wplms/src/pages/profile/profile.ts, line: 20

    All imports are unused.

     

    L19:  import { ResultPage } from ‘../result/result’;

    L20:  import { FriendlytimeComponent } from ‘../../components/friendlytime/friendlytime’;

     

     

    [18:50:54]  tslint: C:/Users/Nexcorp/Documents/ionic/wplms/src/pages/profile/profile.ts, line: 22

    All imports are unused.

     

    L22:  import { PressDirective } from ‘../../directives/longPress.directive’;

    L23:  import { TabsPage } from ‘../tabs/tabs’;

     

    [18:50:54]  tslint: C:/Users/Nexcorp/Documents/ionic/wplms/src/pages/profile/profile.ts, line: 25

    All imports are unused.

     

    L25:  import { Storage } from ‘@ionic/storage’;

    UP-TO-DATE

    :app:processReleaseManifest UP-TO-DATE

    :app:splitsDiscoveryTaskRelease UP-TO-DATE

    L26:  import { Camera, CameraOptions } from ‘@ionic-native/camera’;

     

    [18:50:54]  tslint: C:/Users/Nexcorp/Documents/ionic/wplms/src/services/wishlist.ts, line: 13

    Property ‘config’ is declared but its value is never read.

     

    :app:processReleaseResources

    L12:          private storage: Storage,

    L13:          private config:ConfigService) {

     

    [18:50:54]  tslint: C:/Users/Nexcorp/Documents/ionic/wplms/src/services/wishlist.ts, line: 3

    All imports are unused.

     

    L3:  import { Storage } from ‘@ionic/storage’;

    L4:  import { ConfigService } from “./config”;

     

    [18:50:54]  tslint: C:/Users/Nexcorp/Documents/ionic/wplms/src/components/courseblock/courseblock.ts, line: 17

    Property ‘config’ is declared but its value is never read.

     

    L16:  @ViewChild(‘featured’) featured: ElementRef;

    L17:  constructor(private wishlistService:WishlistService,private config:ConfigService) {

     

    [18:50:54]  tslint: C:/Users/Nexcorp/Documents/ionic/wplms/src/components/courseblock/courseblock.ts, line: 1

    ‘OnInit’ is declared but its value is never read.

     

    L1:  import { Component, Input, OnInit,AfterViewInit, ViewChild,ElementRef } from ‘@angular/core’;

    L2:  import { ConfigService } from ‘../../services/config’;

     

    [18:50:54]  tslint: C:/Users/Nexcorp/Documents/ionic/wplms/src/components/courseblock/courseblock.ts, line: 1

    ‘AfterViewInit’ is declared but its value is never read.

     

    L1:  import { Component, Input, OnInit,AfterViewInit, ViewChild,ElementRef } from ‘@angular/core’;

    L2:  import { ConfigService } from ‘../../services/config’;

     

    [18:50:54]  tslint: C:/Users/Nexcorp/Documents/ionic/wplms/src/components/courseblock/courseblock.ts, line: 1

    ‘ElementRef’ is declared but its value is never read.

     

    L1:  import { Component, Input, OnInit,AfterViewInit, ViewChild,ElementRef } from ‘@angular/core’;

    L2:  import { ConfigService } from ‘../../services/config’;

     

    [18:50:54]  tslint: C:/Users/Nexcorp/Documents/ionic/wplms/src/pages/directory/directory.ts, line: 288

    Duplicate variable: ‘cats’

     

    L287:  console.log(this.selectedLocations);

    L288:  var cats = {‘type’:’taxonomy’,’taxonomy’:’location’,’values’:this.selectedLocations};

    L289:  this.filters.push(cats);

     

    [18:50:54]  tslint: C:/Users/Nexcorp/Documents/ionic/wplms/src/pages/directory/directory.ts, line: 302

    Duplicate variable: ‘cats’

     

    L302:              var cats = {‘type’:’taxonomy’,’taxonomy’:’level’,’values’:this.selectedLevels};

    L303:              this.filters.push(cats);

     

    [18:50:54]  tslint: C:/Users/Nexcorp/Documents/ionic/wplms/src/pages/directory/directory.ts, line: 317

    Duplicate variable: ‘off’

     

    L316:  if(this.start_date){

    L317:      var off = {‘type’:’start_date’,’values’:this.start_date};

    L318:      this.filters.push(off);

     

    [18:50:54]  tslint: C:/Users/Nexcorp/Documents/ionic/wplms/src/pages/directory/directory.ts, line: 322

    Duplicate variable: ‘off’

     

    L321:  if(this.end_date){

    L322:      var off = {‘type’:’end_date’,’values’:this.end_date};

    L323:      this.filters.push(off);

     

    [18:50:54]  tslint: C:/Users/Nexcorp/Documents/ionic/wplms/src/pages/directory/directory.ts, line: 77

    Property ‘nav’ is declared but its value is never read.

     

    L76:  public navParams: NavParams,

    L77:    private nav: NavController,

    L78:    private modalCtrl: ModalController,

     

    [18:50:54]  tslint: C:/Users/Nexcorp/Documents/ionic/wplms/src/pages/directory/directory.ts, line: 1

    ‘OnInit’ is declared but its value is never read.

     

    L1:  import { Component, OnInit } from ‘@angular/core’;

    L2:  import { FormControl } from ‘@angular/forms’;

     

    [18:50:54]  tslint: C:/Users/Nexcorp/Documents/ionic/wplms/src/pages/directory/directory.ts, line: 10

    All imports are unused.

     

    L9:  import { CourseCategory } from ‘../../models/course’;

    L10:  import { Course } from ‘../../models/course’;

    L11:  import { User } from ‘../../models/user’;

     

    [18:50:54]  tslint: C:/Users/Nexcorp/Documents/ionic/wplms/src/pages/directory/directory.ts, line: 12

    All imports are unused.

     

    L11:  import { User } from ‘../../models/user’;

    L12:  import { FullCourseCategory } from ‘../../models/coursecategory’;

     

    [18:50:54]  tslint: C:/Users/Nexcorp/Documents/ionic/wplms/src/pages/directory/directory.ts, line: 15

    All imports are unused.

     

    L14:  import ‘rxjs/add/operator/map’;

    L15:  import { Observable } from ‘rxjs/Observable’;

     

    [18:50:54]  tslint: C:/Users/Nexcorp/Documents/ionic/wplms/src/pages/directory/directory.ts, line: 20

    All imports are unused.

     

    L19:  import { UserService } from ‘../../services/users’;

    L20:  import { Courseblock } from ‘../../components/courseblock/courseblock’;

    L21:  import { WishlistService } from ‘../../services/wishlist’;

     

    [18:50:54]  tslint: …/Documents/ionic/wplms/src/components/fixed-scroll-header/fixed-scroll-header.ts, line: 3

    ‘ElementRef’ is declared but its value is never read.

     

    L2:  Directive,

    L3:  ElementRef,

    L4:  Renderer

     

    [18:50:54]  tslint: …/Documents/ionic/wplms/src/components/fixed-scroll-header/fixed-scroll-header.ts, line: 4

    ‘Renderer’ is declared but its value is never read.

     

    L3:      ElementRef,

    L4:      Renderer

    L5:  } from ‘@angular/core’;

     

    [18:50:54]  tslint: C:/Users/Nexcorp/Documents/ionic/wplms/src/components/coursecard/coursecard.ts, line: 17

    Property ‘config’ is declared but its value is never read.

     

    L16:  constructor(

    L17:      private wishlistService:WishlistService,private config:ConfigService) {

     

    [18:50:54]  tslint: C:/Users/Nexcorp/Documents/ionic/wplms/src/components/coursecard/coursecard.ts, line: 1

    ‘OnInit’ is declared but its value is never read.

     

    L1:  import { Component, Input, OnInit } from ‘@angular/core’;

    L2:  import { ConfigService } from ‘../../services/config’;

     

    [18:50:54]  tslint: C:/Users/Nexcorp/Documents/ionic/wplms/src/pages/home/home.ts, line: 53

    Property ‘walletService’ is declared but its value is never read.

     

    L52:  private wishlistService:WishlistService,

    L53:  private walletService:WalletService ) {

     

    [18:50:54]  tslint: C:/Users/Nexcorp/Documents/ionic/wplms/src/pages/home/home.ts, line: 1

    ‘OnInit’ is declared but its value is never read.

     

    L1:  import { Component, OnInit, ViewChild } from ‘@angular/core’;

    L2:  import { NavController, NavParams, ModalController, LoadingController } from ‘ionic-angular’;

     

    [18:50:54]  tslint: C:/Users/Nexcorp/Documents/ionic/wplms/src/pages/home/home.ts, line: 1

    ‘ViewChild’ is declared but its value is never read.

     

    L1:  import { Component, OnInit, ViewChild } from ‘@angular/core’;

    L2:  import { NavController, NavParams, ModalController, LoadingController } from ‘ionic-angular’;

     

    [18:50:54]  tslint: C:/Users/Nexcorp/Documents/ionic/wplms/src/pages/home/home.ts, line: 2

    ‘NavParams’ is declared but its value is never read.

     

    L1:  import { Component, OnInit, ViewChild } from ‘@angular/core’;

    L2:  import { NavController, NavParams, ModalController, LoadingController } from ‘ionic-angular’;

     

    [18:50:54]  tslint: C:/Users/Nexcorp/Documents/ionic/wplms/src/pages/home/home.ts, line: 5

    All imports are unused.

     

    L4:  //import {StatusBar} from ‘ionic-native’;

    L5:  import { StatusBar } from ‘@ionic-native/status-bar’;

    L6:  import { Content } from ‘ionic-angular’;

     

    [18:50:54]  tslint: C:/Users/Nexcorp/Documents/ionic/wplms/src/pages/home/home.ts, line: 6

    All imports are unused.

     

    L5:  import { StatusBar } from ‘@ionic-native/status-bar’;

    L6:  import { Content } from ‘ionic-angular’;

     

    [18:50:54]  tslint: C:/Users/Nexcorp/Documents/ionic/wplms/src/pages/home/home.ts, line: 26

    All imports are unused.

     

    L26:  import { FixedScrollHeader } from ‘../../components/fixed-scroll-header/fixed-scroll-header’;

    L27:  import { Coursecard } from ‘../../components/coursecard/coursecard’;

     

    [18:50:54]  tslint: C:/Users/Nexcorp/Documents/ionic/wplms/src/pages/home/home.ts, line: 27

    All imports are unused.

     

    L26:  import { FixedScrollHeader } from ‘../../components/fixed-scroll-header/fixed-scroll-header’;

    L27:  import { Coursecard } from ‘../../components/coursecard/coursecard’;

     

    [18:50:54]  tslint: C:/Users/Nexcorp/Documents/ionic/wplms/src/pages/home/home.ts, line: 30

    All imports are unused.

     

    L29:  import ‘rxjs/add/operator/map’;

    L30:  import { Observable } from ‘rxjs/Observable’;

    L31:  @Component({

     

    [18:50:54]  tslint: C:/Users/Nexcorp/Documents/ionic/wplms/src/pages/contact/contact.ts, line: 21

    Property ‘formBuilder’ is declared but its value is never read.

     

    L20:  constructor(public config: ConfigService,

    L21:      private formBuilder: FormBuilder,

    L22:      private toastCtrl:ToastController,

     

    [18:50:54]  tslint: C:/Users/Nexcorp/Documents/ionic/wplms/src/pages/contact/contact.ts, line: 3

    ‘FormBuilder’ is declared but its value is never read.

     

    L2:  import { ToastController, ModalController} from ‘ionic-angular’;

    L3:  import {Validators, FormBuilder, FormGroup } from ‘@angular/forms’;

     

    [18:50:54]  tslint: C:/Users/Nexcorp/Documents/ionic/wplms/src/pages/contact/contact.ts, line: 3

    ‘FormGroup’ is declared but its value is never read.

     

    L2:  import { ToastController, ModalController} from ‘ionic-angular’;

    L3:  import {Validators, FormBuilder, FormGroup } from ‘@angular/forms’;

     

    [18:50:54]  tslint: C:/Users/Nexcorp/Documents/ionic/wplms/src/pages/wallet/wallet.ts, line: 39

    Property ‘toast’ is declared but its value is never read.

     

    L38:  private config:ConfigService,

    L39:  private toast:ToastController,

    L40:  private nav:NavController,

     

    [18:50:54]  tslint: C:/Users/Nexcorp/Documents/ionic/wplms/src/pages/wallet/wallet.ts, line: 40

    Property ‘nav’ is declared but its value is never read.

     

    L39:  private toast:ToastController,

    L40:  private nav:NavController,

    L41:  private storage:Storage

     

    [18:50:54]  tslint: C:/Users/Nexcorp/Documents/ionic/wplms/src/pages/wallet/wallet.ts, line: 41

    Property ‘storage’ is declared but its value is never read.

     

    L40:  private nav:NavController,

    L41:  private storage:Storage

    L42:  ) {

     

    [18:50:54]  tslint: C:/Users/Nexcorp/Documents/ionic/wplms/src/pages/wallet/wallet.ts, line: 1

    ‘OnInit’ is declared but its value is never read.

     

    L1:  import { Component, OnInit , ViewChild} from ‘@angular/core’;

     

    [18:50:54]  tslint: C:/Users/Nexcorp/Documents/ionic/wplms/src/pages/wallet/wallet.ts, line: 3

    ‘LoadingController’ is declared but its value is never read.

     

    L3:  import { NavController,LoadingController, ToastController, Slides,Platform } from ‘ionic-angular’;

     

    [18:50:54]  tslint: C:/Users/Nexcorp/Documents/ionic/wplms/src/pages/wallet/wallet.ts, line: 3

    ‘Platform’ is declared but its value is never read.

     

    L3:  import { NavController,LoadingController, ToastController, Slides,Platform } from ‘ionic-angular’;

     

    [18:50:54]  tslint: C:/Users/Nexcorp/Documents/ionic/wplms/src/pages/wallet/wallet.ts, line: 8

    All imports are unused.

     

    L8:  import { Storage } from ‘@ionic/storage’;

    L9:  import { Wallet } from “../models/wallet”;

     

    [18:50:54]  tslint: C:/Users/Nexcorp/Documents/ionic/wplms/src/pages/wallet/wallet.ts, line: 9

    All imports are unused.

     

    L8:  import { Storage } from ‘@ionic/storage’;

    L9:  import { Wallet } from “../models/wallet”;

     

    [18:50:54]  tslint: C:/Users/Nexcorp/Documents/ionic/wplms/src/pages/wallet/wallet.ts, line: 12

    All imports are unused.

     

    L11:  import ‘rxjs/add/operator/map’;

    L12:  import { Observable } from ‘rxjs/Observable’;

     

    [18:50:54]  tslint: C:/Users/Nexcorp/Documents/ionic/wplms/src/pages/wallet/wallet.ts, line: 14

    All imports are unused.

     

    L14:  import { Chart } from ‘chart.js’;

     

    [18:50:54]  tslint: C:/Users/Nexcorp/Documents/ionic/wplms/src/pages/wishlist/wishlist.ts, line: 15

    Property ‘config’ is declared but its value is never read.

     

    L14:  private wishlistService:WishlistService,

    L15:  private config:ConfigService) {

     

    [18:50:54]  tslint: C:/Users/Nexcorp/Documents/ionic/wplms/src/pages/wishlist/wishlist.ts, line: 1

    ‘OnInit’ is declared but its value is never read.

     

    L1:  import { Component,OnInit } from ‘@angular/core’;

     

    [18:50:54]  tslint: C:/Users/Nexcorp/Documents/ionic/wplms/src/pages/wishlist/wishlist.ts, line: 5

    All imports are unused.

     

    L4:  import { WishlistService } from ‘../../services/wishlist’;

    L5:  import { Courseblock } from ‘../../components/courseblock/courseblock’;

    L6:  @Component({

     

    [18:50:54]  tslint: C:/Users/Nexcorp/Documents/ionic/wplms/src/services/updates.ts, line: 76

    ‘markRead’ is declared but its value is never read.

     

    L76:      private markRead(update){

    L77:              if(this.readupdates.length){

     

    [18:50:54]  tslint: C:/Users/Nexcorp/Documents/ionic/wplms/src/services/updates.ts, line: 99

    ‘markUnread’ is declared but its value is never read.

     

    L99:      private markUnread(update){

    L100:              if(this.readupdates.length){

     

    [18:50:54]  tslint: C:/Users/Nexcorp/Documents/ionic/wplms/src/services/updates.ts, line: 4

    All imports are unused.

     

    L4:  import { Storage } from ‘@ionic/storage’;

    L5:  import { ConfigService } from “./config”;

     

    [18:50:54]  tslint: C:/Users/Nexcorp/Documents/ionic/wplms/src/pages/updates/updates.ts, line: 1

    ‘OnInit’ is declared but its value is never read.

     

    L1:  import { Component, OnInit } from ‘@angular/core’;

    L2:  import { ViewController } from ‘ionic-angular’;

     

    [18:50:54]  tslint: C:/Users/Nexcorp/Documents/ionic/wplms/src/pages/updates/updates.ts, line: 6

    All imports are unused.

     

    L5:  import { UpdatesService } from ‘../../services/updates’;

    L6:  import { OrderPipe } from ‘../../pipes/orderby’;

    L7:  @Component({

     

    [18:50:54]  tslint: C:/Users/Nexcorp/Documents/ionic/wplms/src/pages/tabs/tabs.ts, line: 38

    Property ‘nav’ is declared but its value is never read.

     

    L37:  constructor(

    L38:    private nav: NavController,

    L39:    private navParams: NavParams,

     

    [18:50:54]  tslint: C:/Users/Nexcorp/Documents/ionic/wplms/src/pages/tabs/tabs.ts, line: 39

    Property ‘navParams’ is declared but its value is never read.

     

    L38:  private nav: NavController,

    L39:  private navParams: NavParams,

    L40:  private config:ConfigService,

     

    [18:50:54]  tslint: C:/Users/Nexcorp/Documents/ionic/wplms/src/pages/tabs/tabs.ts, line: 41

    Property ‘app’ is declared but its value is never read.

     

    L40:  private config:ConfigService,

    L41:  private app:App,

    L42:  private storage:Storage) {

     

    [18:50:54]  tslint: C:/Users/Nexcorp/Documents/ionic/wplms/src/pages/tabs/tabs.ts, line: 42

    Property ‘storage’ is declared but its value is never read.

     

    L41:  private app:App,

    L42:  private storage:Storage) {

     

    [18:50:54]  tslint: C:/Users/Nexcorp/Documents/ionic/wplms/src/pages/tabs/tabs.ts, line: 14

    All imports are unused.

     

    L13:  import { ConfigService } from ‘../../services/config’;

    L14:  import { Storage } from ‘@ionic/storage’;

     

    [18:50:54]  tslint: C:/Users/Nexcorp/Documents/ionic/wplms/src/pages/intro/intro.ts, line: 4

    All imports are unused.

     

    L3:  import { ConfigService } from ‘../../services/config’;

    L4:  import { Storage } from ‘@ionic/storage’;

    L5:  import { TabsPage } from ‘../tabs/tabs’;

     

    [18:50:54]  tslint: C:/Users/Nexcorp/Documents/ionic/wplms/src/pages/post/post.ts, line: 17

    Property ‘config’ is declared but its value is never read.

     

    L16:  private blog:BlogService,

    L17:  private config:ConfigService,

    L18:  private loadingController:LoadingController) {

     

    [18:50:54]  tslint: C:/Users/Nexcorp/Documents/ionic/wplms/src/pages/post/post.ts, line: 1

    ‘OnInit’ is declared but its value is never read.

     

    L1:  import { Component,OnInit } from ‘@angular/core’;

     

    [18:50:54]  tslint: C:/Users/Nexcorp/Documents/ionic/wplms/src/pages/blog/blog.ts, line: 1

    ‘OnInit’ is declared but its value is never read.

     

    L1:  import { Component, OnInit } from ‘@angular/core’;

     

    [18:50:54]  tslint: C:/Users/Nexcorp/Documents/ionic/wplms/src/pages/instructor/instructor.ts, line: 36

    Property ‘courseService’ is declared but its value is never read.

     

    L35:  private config:ConfigService,

    L36:  private courseService:CourseService,

    L37:  private userService:UserService,

     

    [18:50:54]  tslint: C:/Users/Nexcorp/Documents/ionic/wplms/src/pages/instructor/instructor.ts, line: 1

    ‘OnInit’ is declared but its value is never read.

     

    L1:  import { Component, OnInit,ViewChild } from ‘@angular/core’;

    L2:  import { NavController, NavParams,ViewController, Slides } from ‘ionic-angular’;

     

    [18:50:54]  tslint: C:/Users/Nexcorp/Documents/ionic/wplms/src/pages/instructors/instructors.ts, line: 1

    ‘OnInit’ is declared but its value is never read.

     

    L1:  import { Component, OnInit } from ‘@angular/core’;

    L2:  import { NavController, NavParams, ModalController,LoadingController } from ‘ionic-angular’;

     

    [18:50:54]  tslint: C:/Users/Nexcorp/Documents/ionic/wplms/src/app/app.component.ts, line: 33

    Property ‘platform’ is declared but its value is never read.

     

    L32:  constructor(private config:ConfigService,

    L33:      private platform: Platform,

    L34:      private menuCtrl: MenuController,

     

    [18:50:54]  tslint: C:/Users/Nexcorp/Documents/ionic/wplms/src/app/app.component.ts, line: 38

    Property ‘imgcacheService’ is declared but its value is never read.

     

    L37:  private storage:Storage,

    L38:  private imgcacheService:ImgcacheService,

    L39:  public splashScreen: SplashScreen) {

     

    [18:50:54]  tslint: C:/Users/Nexcorp/Documents/ionic/wplms/src/app/app.component.ts, line: 1

    ‘OnInit’ is declared but its value is never read.

     

    L1:  import { Component, OnInit, ViewChild } from ‘@angular/core’;

    L2:  import { App, Platform, NavController, MenuController,LoadingController } from ‘ionic-angular’;

     

    [18:50:54]  tslint: C:/Users/Nexcorp/Documents/ionic/wplms/src/app/app.component.ts, line: 14

    All imports are unused.

     

    L13:  import { ConfigService } from ‘../services/config’;

    L14:  import { Storage } from ‘@ionic/storage’;

    L15:  import { ImgcacheService } from ‘../services/imageCache’;

     

    [18:50:54]  tslint: C:/Users/Nexcorp/Documents/ionic/wplms/src/directives/lazy-load.directive.ts, line: 2

    ‘ElementRef’ is declared but its value is never read.

     

    L1:  import { Directive,

    L2:           ElementRef,

    L3:           EventEmitter,

     

    [18:50:54]  tslint: C:/Users/Nexcorp/Documents/ionic/wplms/src/directives/lazy-load.directive.ts, line: 6

    ‘OnInit’ is declared but its value is never read.

     

    L5:           Output,

    L6:           OnInit, OnDestroy, Renderer2 } from ‘@angular/core’;

     

    [18:50:54]  tslint: C:/Users/Nexcorp/Documents/ionic/wplms/src/directives/lazy-load.directive.ts, line: 6

    ‘OnDestroy’ is declared but its value is never read.

     

    L5:           Output,

    L6:           OnInit, OnDestroy, Renderer2 } from ‘@angular/core’;

     

    [18:50:54]  tslint: C:/Users/Nexcorp/Documents/ionic/wplms/src/directives/lazy-load.directive.ts, line: 6

    ‘Renderer2’ is declared but its value is never read.

     

    L5:           Output,

    L6:           OnInit, OnDestroy, Renderer2 } from ‘@angular/core’;

     

    [18:50:54]  tslint: …rs/Nexcorp/Documents/ionic/wplms/src/components/elastic-header/elastic-header.ts, line: 1

    ‘ElementRef’ is declared but its value is never read.

     

    L1:  import { Directive, ElementRef, Renderer } from ‘@angular/core’;

     

    [18:50:54]  tslint: …rs/Nexcorp/Documents/ionic/wplms/src/components/elastic-header/elastic-header.ts, line: 1

    ‘Renderer’ is declared but its value is never read.

     

    L1:  import { Directive, ElementRef, Renderer } from ‘@angular/core’;

     

    [18:50:54]  tslint: …/Documents/ionic/wplms/src/components/avatarscrollzoomout/avatarscrollzoomout.ts, line: 1

    ‘ElementRef’ is declared but its value is never read.

     

    L1:  import { Directive, ElementRef, Renderer } from ‘@angular/core’;

     

    [18:50:54]  tslint: …/Documents/ionic/wplms/src/components/avatarscrollzoomout/avatarscrollzoomout.ts, line: 1

    ‘Renderer’ is declared but its value is never read.

     

    L1:  import { Directive, ElementRef, Renderer } from ‘@angular/core’;

     

    [18:50:54]  tslint: C:/Users/Nexcorp/Documents/ionic/wplms/src/components/pipefilters.ts, line: 1

    ‘PipeTransform’ is declared but its value is never read.

     

    L1:  import { PipeTransform, Pipe, Injectable } from ‘@angular/core’;

     

    [18:50:54]  tslint: …/Nexcorp/Documents/ionic/wplms/src/components/instructorblock/instructorblock.ts, line: 17

    Property ‘config’ is declared but its value is never read.

     

    L16:   @Input(‘instructor’) instructor;

    L17:  constructor(private config:ConfigService) {

     

    [18:50:54]  tslint: …/Nexcorp/Documents/ionic/wplms/src/components/instructorblock/instructorblock.ts, line: 1

    ‘OnInit’ is declared but its value is never read.

     

    L1:  import { Component, Input, OnInit } from ‘@angular/core’;

     

    [18:50:54]  tslint: C:/Users/Nexcorp/Documents/ionic/wplms/src/components/match/match.ts, line: 9

    Property ‘elementRef’ is declared but its value is never read.

     

    L9:    constructor(private elementRef: ElementRef) {

     

    [18:50:54]  tslint: C:/Users/Nexcorp/Documents/ionic/wplms/src/components/match/match.ts, line: 1

    ‘ElementRef’ is declared but its value is never read.

     

    L1:  import { Directive,ElementRef, OnInit } from ‘@angular/core’;

     

    [18:50:54]  tslint: C:/Users/Nexcorp/Documents/ionic/wplms/src/components/match/match.ts, line: 1

    ‘OnInit’ is declared but its value is never read.

     

    L1:  import { Directive,ElementRef, OnInit } from ‘@angular/core’;

     

    [18:50:54]  tslint: C:/Users/Nexcorp/Documents/ionic/wplms/src/components/fillblank/fillblank.ts, line: 8

    Property ‘elementRef’ is declared but its value is never read.

     

    L8:    constructor(private elementRef: ElementRef) {

     

    [18:50:54]  tslint: C:/Users/Nexcorp/Documents/ionic/wplms/src/components/fillblank/fillblank.ts, line: 1

    ‘ElementRef’ is declared but its value is never read.

     

    L1:  import { Directive,ElementRef, OnInit } from ‘@angular/core’;

     

    [18:50:54]  tslint: C:/Users/Nexcorp/Documents/ionic/wplms/src/components/fillblank/fillblank.ts, line: 1

    ‘OnInit’ is declared but its value is never read.

     

    L1:  import { Directive,ElementRef, OnInit } from ‘@angular/core’;

     

    [18:50:54]  tslint: C:/Users/Nexcorp/Documents/ionic/wplms/src/components/select/select.ts, line: 1

    ‘ElementRef’ is declared but its value is never read.

     

    L1:  import { Directive,ElementRef, OnInit } from ‘@angular/core’;

     

    [18:50:54]  tslint: C:/Users/Nexcorp/Documents/ionic/wplms/src/components/select/select.ts, line: 1

    ‘OnInit’ is declared but its value is never read.

     

    L1:  import { Directive,ElementRef, OnInit } from ‘@angular/core’;

     

    [18:50:54]  tslint: C:/Users/Nexcorp/Documents/ionic/wplms/src/components/FormValidator.ts, line: 2

    ‘Validator’ is declared but its value is never read.

     

    L1:  import { Directive } from ‘@angular/core’;

    L2:  import { Validator, AbstractControl, NG_VALIDATORS } from ‘@angular/forms’;

     

    [18:50:54]  tslint: C:/Users/Nexcorp/Documents/ionic/wplms/src/components/FormValidator.ts, line: 2

    ‘AbstractControl’ is declared but its value is never read.

     

    L1:  import { Directive } from ‘@angular/core’;

    L2:  import { Validator, AbstractControl, NG_VALIDATORS } from ‘@angular/forms’;

     

    [18:50:54]  tslint: C:/Users/Nexcorp/Documents/ionic/wplms/src/components/swipedtab/swipedtab.ts, line: 1

    ‘ElementRef’ is declared but its value is never read.

     

    L1:  import { Component, ElementRef, Input, Renderer } from ‘@angular/core’;

     

    [18:50:54]  tslint: C:/Users/Nexcorp/Documents/ionic/wplms/src/components/swipedtab/swipedtab.ts, line: 1

    ‘Renderer’ is declared but its value is never read.

     

    L1:  import { Component, ElementRef, Input, Renderer } from ‘@angular/core’;

     

    [18:50:54]  tslint: C:/Users/Nexcorp/Documents/ionic/wplms/src/services/coursecategories.ts, line: 24

    Property ‘config’ is declared but its value is never read.

     

    L23:  private http:Http,

    L24:  private config:ConfigService) {

     

    [18:50:55]  tslint: C:/Users/Nexcorp/Documents/ionic/wplms/src/services/coursecategories.ts, line: 2

    All imports are unused.

     

    L1:  import { Injectable } from ‘@angular/core’;

    L2:  import { Http, Response } from ‘@angular/http’;

    L3:  import ‘rxjs/add/operator/map’;

     

    [18:50:55]  tslint: C:/Users/Nexcorp/Documents/ionic/wplms/src/validators/email.ts, line: 1

    All imports are unused.

     

    L1:  import { FormControl } from ‘@angular/forms’;

     

    [18:50:55]  tslint: C:/Users/Nexcorp/Documents/ionic/wplms/src/validators/username.ts, line: 1

    All imports are unused.

     

    L1:  import { FormControl } from ‘@angular/forms’;

     

    [18:50:55]  lint finished in 7.48 s

    #11302

    Daniel
    Participant

    I have problems generating the .apk

    I add a text file so they can validate the error and can help me or give me some solution.

     

    http://campus.nextech.pe/wp-content/uploads/2018/04/error_android-1.txt

    #11313

    Alex
    Keymaster

    this is an error with facebook login cordova plugin :

    https://github.com/gurisko/cordova-plugin-accountkit/issues/19#issuecomment-354545621 

    Change the app id and app name and  add the code in your strings.xml file.

    #11352

    Daniel
    Participant

    I made the changes that you indicated to me but now this error generates me:

    C:\Users\Nexcorp\Documents\ionic\wplms>ionic cordova build –release android

    Running app-scripts build: –platform android –target cordova

    [10:10:37]  build dev started …

    [10:10:37]  clean started …

    [10:10:37]  clean finished in 4 ms

    [10:10:37]  copy started …

    [10:10:37]  deeplinks started …

    [10:10:38]  deeplinks finished in 410 ms

    [10:10:38]  transpile started …

    [10:10:43]  transpile finished in 5.54 s

    [10:10:43]  preprocess started …

    [10:10:43]  preprocess finished in 1 ms

    [10:10:43]  webpack started …

    [10:10:44]  copy finished in 6.26 s

    [10:10:51]  webpack finished in 8.05 s

    [10:10:51]  sass started …

    [10:10:53]  sass finished in 1.13 s

    [10:10:53]  postprocess started …

    [10:10:53]  postprocess finished in 9 ms

    [10:10:53]  lint started …

    [10:10:53]  build dev finished in 15.37 s

    > cordova build android –release

    Android Studio project detected

     

    ANDROID_HOME=C:\Users\Nexcorp\AppData\Local\Android\Sdk

    JAVA_HOME=C:\Program Files\Java\jdk1.8.0_144

    studio

    Subproject Path: CordovaLib

    Subproject Path: app

    publishNonDefault is deprecated and has no effect anymore. All variants are now published.

     

    The Task.leftShift(Closure) method has been deprecated and is scheduled to be removed in Gradle 5.0. Please use Task.doLast(Action) instead.

    at build_4patict3zccmo1j8jeng0y3li.run(C:\Users\Nexcorp\Documents\ionic\wplms\platforms\android\app\build.gradle:143)

    Configuration ‘compile’ in project ‘:app’ is deprecated. Use ‘implementation’ instead.

    :CordovaLib:preBuild UP-TO-DATE

    :CordovaLib:preReleaseBuild UP-TO-DATE

    :CordovaLib:compileReleaseAidl UP-TO-DATE

    :CordovaLib:compileReleaseRenderscript UP-TO-DATE

    :CordovaLib:checkReleaseManifest UP-TO-DATE

    :CordovaLib:generateReleaseBuildConfig UP-TO-DATE

    :CordovaLib:prepareLintJar UP-TO-DATE

    :CordovaLib:generateReleaseResValues UP-TO-DATE

    :CordovaLib:generateReleaseResources UP-TO-DATE

    :CordovaLib:packageReleaseResources UP-TO-DATE

    :CordovaLib:platformAttrExtractor UP-TO-DATE

    :CordovaLib:processReleaseManifest UP-TO-DATE

    :CordovaLib:processReleaseResources UP-TO-DATE

    :CordovaLib:generateReleaseSources UP-TO-DATE

    :CordovaLib:javaPreCompileRelease UP-TO-DATE

    :CordovaLib:compileReleaseJavaWithJavac

    UP-TO-DATE

    :CordovaLib:processReleaseJavaRes NO-SOURCE

    :CordovaLib:transformClassesAndResourcesWithPrepareIntermediateJarsForRelease UP-TO-DATE

    :app:preBuild UP-TO-DATE

    :app:preReleaseBuild

    UP-TO-DATE

    :app:compileReleaseAidl

     

    UP-TO-DATE

    :CordovaLib:packageReleaseRenderscript NO-SOURCE

    :app:compileReleaseRenderscript UP-TO-DATE

    :app:checkReleaseManifest UP-TO-DATE

    :app:generateReleaseBuildConfig UP-TO-DATE

    :app:prepareLintJar UP-TO-DATE

    :app:generateReleaseResValues UP-TO-DATE

    :app:generateReleaseResources UP-TO-DATE

    :app:mergeReleaseResources

     

    UP-TO-DATE

    :app:createReleaseCompatibleScreenManifests UP-TO-DATE

    :app:processReleaseManifest

     

    UP-TO-DATE

    :app:splitsDiscoveryTaskRelease UP-TO-DATE

    :app:processReleaseResources

     

    UP-TO-DATE

    :app:generateReleaseSources UP-TO-DATE

    :app:javaPreCompileRelease UP-TO-DATE

    :app:compileReleaseJavaWithJavac

    C:\Users\Nexcorp\Documents\ionic\wplms\platforms\android\app\src\main\java\com\alexdisler\inapppurchases\IabHelper.java:33: error: package com.android.vending.billing does not exist

    import com.android.vending.billing.IInAppBillingService;

     

    ^

    C:\Users\Nexcorp\Documents\ionic\wplms\platforms\android\app\src\main\java\com\alexdisler\inapppurchases\IabHelper.java:103: error: cannot find symbol

    IInAppBillingService mService;

    ^

    symbol:   class IInAppBillingService

    location: class IabHelper

    C:\Users\Nexcorp\Documents\ionic\wplms\platforms\android\app\src\main\java\com\alexdisler\inapppurchases\IabHelper.java:230: error: package IInAppBillingService does not exist

    mService = IInAppBillingService.Stub.asInterface(service);

    ^

    Note: Some input files use or override a deprecated API.

    Note: Recompile with -Xlint:deprecation for details.

    Note: Some input files use unchecked or unsafe operations.

    Note: Recompile with -Xlint:unchecked for details.

    3 errors

    FAILED

    27 actionable tasks: 1 executed, 26 up-to-date

     

    FAILURE: Build failed with an exception.

     

    * What went wrong:

    Execution failed for task ‘:app:compileReleaseJavaWithJavac’.

    > Compilation failed; see the compiler error output for details.

     

    * Try:

    Run with –stacktrace option to get the stack trace. Run with –info or –debug option to get more log output.

     

    * Get more help at https://help.gradle.org

     

    BUILD FAILED in 3s

    (node:10696) UnhandledPromiseRejectionWarning: Error: cmd: Command failed with exit code 1 Error output:

    C:\Users\Nexcorp\Documents\ionic\wplms\platforms\android\app\src\main\java\com\alexdisler\inapppurchases\IabHelper.java:33: error: package com.android.vending.billing does not exist

    import com.android.vending.billing.IInAppBillingService;

    ^

    C:\Users\Nexcorp\Documents\ionic\wplms\platforms\android\app\src\main\java\com\alexdisler\inapppurchases\IabHelper.java:103: error: cannot find symbol

    IInAppBillingService mService;

    ^

    symbol:   class IInAppBillingService

    location: class IabHelper

    C:\Users\Nexcorp\Documents\ionic\wplms\platforms\android\app\src\main\java\com\alexdisler\inapppurchases\IabHelper.java:230: error: package IInAppBillingService does not exist

    mService = IInAppBillingService.Stub.asInterface(service);

    ^

    Note: Some input files use or override a deprecated API.

    Note: Recompile with -Xlint:deprecation for details.

    Note: Some input files use unchecked or unsafe operations.

    Note: Recompile with -Xlint:unchecked for details.

    3 errors

     

    FAILURE: Build failed with an exception.

     

    * What went wrong:

    Execution failed for task ‘:app:compileReleaseJavaWithJavac’.

    > Compilation failed; see the compiler error output for details.

     

    * Try:

    Run with –stacktrace option to get the stack trace. Run with –info or –debug option to get more log output.

     

    * Get more help at https://help.gradle.org

     

    BUILD FAILED in 3s

    at ChildProcess.whenDone (C:\Users\Nexcorp\Documents\ionic\wplms\platforms\android\cordova\node_modules\cordova-common\src\superspawn.js:169:23)

    at emitTwo (events.js:126:13)

    at ChildProcess.emit (events.js:214:7)

    at maybeClose (internal/child_process.js:925:16)

    at Process.ChildProcess._handle.onexit (internal/child_process.js:209:5)

    (node:10696) UnhandledPromiseRejectionWarning: Unhandled promise rejection. This error originated either by throwing inside of an async function without a catch block, or by rejecting a promise which was not handled with .catch(). (rejection id: 1)

    (node:10696) [DEP0018] DeprecationWarning: Unhandled promise rejections are deprecated. In the future, promise rejections that are not handled will terminate the Node.js process with a non-zero exit code.

    #11374

    Alex
    Keymaster

    Well now its cordova error .
    Please refer this solution here : https://github.com/AlexDisler/cordova-plugin-inapppurchase/issues/38#issuecomment-369337959

     

    If folders are not there then simply create them .

    FIrst try above solution but it still does not works then please take backup of your ionic setup (to restore the files in case something does not work )and then open terminal or cmd navigate to your ionic project and run this command :

    ionic cordova platform rm android

    ionic cordova platform add [email protected]

    #11390

    Daniel
    Participant

    Again Show me this error

     

    :app:compileReleaseJavaWithJavac

    C:\Users\Nexcorp\Documents\ionic\wplms\platforms\android\app\src\main\java\com\alexdisler\inapppurchases\IabHelper.java:33: error: package com.android.vending.billing does not exist

    import com.android.vending.billing.IInAppBillingService;

    ^

    C:\Users\Nexcorp\Documents\ionic\wplms\platforms\android\app\src\main\java\com\alexdisler\inapppurchases\IabHelper.java:103: error: cannot find symbol

    IInAppBillingService mService;

    ^

    symbol:   class IInAppBillingService

    location: class IabHelper

    C:\Users\Nexcorp\Documents\ionic\wplms\platforms\android\app\src\main\java\com\alexdisler\inapppurchases\IabHelper.java:230: error: package IInAppBillingService does not exist

     

    mService = IInAppBillingService.Stub.asInterface(service);

    ^

    Note: Some input files use or override a deprecated API.

    FAILED

    Note: Recompile with -Xlint:deprecation for details.

    Note: Some input files use unchecked or unsafe operations.

    Note: Recompile with -Xlint:unchecked for details.

    3 errors

     

    FAILURE: Build failed with an exception.

     

    * What went wrong:

    Execution failed for task ‘:app:compileReleaseJavaWithJavac’.

    > Compilation failed; see the compiler error output for details.

     

    * Try:

    Run with –stacktrace option to get the stack trace. Run with –info or –debug option to get more log output.

     

    * Get more help at https://help.gradle.org

     

    BUILD FAILED in 5s

    27 actionable tasks: 1 executed, 26 up-to-date

    (node:13740) UnhandledPromiseRejectionWarning: Error: cmd: Command failed with exit code 1 Error output:

    C:\Users\Nexcorp\Documents\ionic\wplms\platforms\android\app\src\main\java\com\alexdisler\inapppurchases\IabHelper.java:33: error: package com.android.vending.billing does not exist

    import com.android.vending.billing.IInAppBillingService;

    ^

    C:\Users\Nexcorp\Documents\ionic\wplms\platforms\android\app\src\main\java\com\alexdisler\inapppurchases\IabHelper.java:103: error: cannot find symbol

    IInAppBillingService mService;

    ^

    symbol:   class IInAppBillingService

    location: class IabHelper

    C:\Users\Nexcorp\Documents\ionic\wplms\platforms\android\app\src\main\java\com\alexdisler\inapppurchases\IabHelper.java:230: error: package IInAppBillingService does not exist

    mService = IInAppBillingService.Stub.asInterface(service);

    ^

    Note: Some input files use or override a deprecated API.

    Note: Recompile with -Xlint:deprecation for details.

    Note: Some input files use unchecked or unsafe operations.

    Note: Recompile with -Xlint:unchecked for details.

    3 errors

     

    FAILURE: Build failed with an exception.

     

    * What went wrong:

    Execution failed for task ‘:app:compileReleaseJavaWithJavac’.

    > Compilation failed; see the compiler error output for details.

     

    * Try:

    Run with –stacktrace option to get the stack trace. Run with –info or –debug option to get more log output.

     

    * Get more help at https://help.gradle.org

     

    BUILD FAILED in 5s

    at ChildProcess.whenDone (C:\Users\Nexcorp\Documents\ionic\wplms\platforms\android\cordova\node_modules\cordova-common\src\superspawn.js:169:23)

    at emitTwo (events.js:126:13)

    at ChildProcess.emit (events.js:214:7)

    at maybeClose (internal/child_process.js:925:16)

    at Process.ChildProcess._handle.onexit (internal/child_process.js:209:5)

    (node:13740) UnhandledPromiseRejectionWarning: Unhandled promise rejection. This error originated either by throwing inside of an async function without a catch block, or by rejecting a promise which was not handled with .catch(). (rejection id: 1)

    (node:13740) [DEP0018] DeprecationWarning: Unhandled promise rejections are deprecated. In the future, promise rejections that are not handled will terminate the Node.js process with a non-zero exit code.

    #11405

    Alex
    Keymaster

    Well I faced the same issue and got it resolved using the solution mentioned here :  https://github.com/AlexDisler/cordova-plugin-inapppurchase/issues/38#issuecomment-369337959 

    You need to make sure of the extension of the file and create folders in suitable place .

    Or if you do not want to use In app purcahse feature then please run this command :

    cordova plugin rm cordova-plugin-inapppurchase

     

    the try building apk file .

Viewing 8 posts - 1 through 8 (of 8 total)

You must be logged in to reply to this topic.

Template Design © VibeThemes. All rights reserved.